{"text_format":"1","workbook":"xlsx","n_sheets":14,"sheets":["ANEXO A","FORMULÁRIO","DADOS GERAIS-A","calculo","PISTA","DEC","APROX","APROX INTERNA","TRANSIÇÃO INTERNA","POUSO INTERROMPIDO","TRANSIÇÃO","HORIZONTAL INTERNA","CÔNICA","SPVV"],"not_rendered":{"charts":0,"images":1,"macros":1,"external_links":0,"defined_names":13,"comments":1,"pivot_tables":0},"unopened":[],"bounds":{"document_bytes":16777216,"sheet_cells":100000,"rows_first":2000,"rows_last":500,"rows_between":2000,"halvings":0,"cell_chars":16384,"cell_head_chars":4096},"cells_cut":0,"cells_raw":0,"read":"whole","date_system":"1900"}

{"sheet":"ANEXO A","index":0,"n_rows":154,"n_cols":8,"rows_kept":154,"cut":false,"hidden":false,"merged":[[0,0,0,7],[2,0,2,7],[5,2,5,7],[6,2,6,7],[7,2,7,7],[8,2,8,7],[9,2,9,7],[10,2,10,3],[10,4,10,5],[10,6,10,7],[11,0,12,0],[11,1,12,1],[11,2,11,3],[11,4,11,5],[11,6,11,7],[12,2,12,3],[17,2,17,3],[17,4,17,5],[17,6,17,7],[16,2,16,3],[16,4,16,5],[16,6,16,7],[12,4,12,5],[12,6,12,7],[13,2,13,3],[13,4,13,5],[13,6,13,7],[14,2,14,3],[14,4,14,5],[14,6,14,7],[15,2,15,3],[15,4,15,5],[15,6,15,7],[18,2,18,3],[18,4,18,5],[18,6,18,7],[21,2,21,3],[21,4,21,5],[21,6,21,7],[22,2,22,3],[22,4,22,5],[22,6,22,7],[19,2,19,3],[19,4,19,5],[19,6,19,7],[20,2,20,3],[20,4,20,5],[20,6,20,7],[26,2,26,3],[26,4,26,5],[26,6,26,7],[27,2,27,3],[27,4,27,5],[27,6,27,7],[23,2,23,3],[23,4,23,5],[23,6,23,7],[24,2,24,3],[24,4,24,5],[24,6,24,7],[25,6,25,7],[25,4,25,5],[30,2,30,3],[30,4,30,5],[30,6,30,7],[31,2,31,3],[31,4,31,5],[31,6,31,7],[28,2,28,3],[28,4,28,5],[28,6,28,7],[29,2,29,3],[29,4,29,5],[29,6,29,7],[34,2,34,3],[34,4,34,5],[34,6,34,7],[35,2,35,3],[35,4,35,5],[35,6,35,7],[32,2,32,3],[32,4,32,5],[32,6,32,7],[33,2,33,3],[33,4,33,5],[33,6,33,7],[38,2,38,3],[38,4,38,5],[38,6,38,7],[39,2,39,3],[39,4,39,5],[39,6,39,7],[36,2,36,3],[36,4,36,5],[36,6,36,7],[37,2,37,3],[37,4,37,5],[37,6,37,7],[45,4,45,5],[45,6,45,7],[46,4,46,5],[46,6,46,7],[43,4,43,5],[43,6,43,7],[44,4,44,5],[44,6,44,7],[40,2,40,3],[40,4,40,5],[40,6,40,7],[41,2,41,3],[41,4,41,5],[41,6,41,7],[42,6,42,7],[45,2,45,3],[46,2,46,3],[42,4,42,5],[42,2,42,3],[43,2,43,3],[44,2,44,3],[49,2,49,3],[49,4,49,5],[49,6,49,7],[50,2,50,3],[50,4,50,5],[50,6,50,7],[47,4,47,5],[47,6,47,7],[48,2,48,3],[48,4,48,5],[48,6,48,7],[47,2,47,3],[53,2,53,3],[53,4,53,5],[53,6,53,7],[55,0,55,7],[111,2,111,3],[111,4,111,5],[111,6,111,7],[51,2,51,3],[51,4,51,5],[51,6,51,7],[52,2,52,3],[52,4,52,5],[52,6,52,7],[114,2,114,3],[114,4,114,5],[114,6,114,7],[115,2,115,3],[115,4,115,5],[115,6,115,7],[112,2,112,3],[112,4,112,5],[112,6,112,7],[113,2,113,3],[113,4,113,5],[113,6,113,7],[118,2,118,3],[118,4,118,5],[118,6,118,7],[119,2,119,3],[119,4,119,5],[119,6,119,7],[116,2,116,3],[116,4,116,5],[116,6,116,7],[117,2,117,3],[117,4,117,5],[117,6,117,7],[122,2,122,3],[122,4,122,5],[122,6,122,7],[123,2,123,3],[123,4,123,5],[123,6,123,7],[120,2,120,3],[120,4,120,5],[120,6,120,7],[121,2,121,3],[121,4,121,5],[121,6,121,7],[127,0,127,1],[130,0,130,1],[133,0,133,1],[133,2,133,3],[133,4,133,5],[133,6,133,7],[124,2,124,3],[124,4,124,5],[124,6,124,7],[125,2,125,3],[125,4,125,5],[125,6,125,7],[134,2,134,3],[134,4,134,5],[134,6,134,7],[135,2,135,3],[135,4,135,5],[135,6,135,7],[126,2,126,3],[126,4,126,5],[126,6,126,7],[142,0,142,1],[145,0,145,1],[145,2,145,3],[145,4,145,5],[145,6,145,7],[136,2,136,3],[136,4,136,5],[136,6,136,7],[137,2,137,3],[137,4,137,5],[137,6,137,7],[152,0,152,1],[25,2,25,3],[150,2,150,3],[150,4,150,5],[150,6,150,7],[151,2,151,3],[151,4,151,5],[151,6,151,7],[148,2,148,3],[148,4,148,5],[148,6,148,7],[149,2,149,3],[149,4,149,5],[149,6,149,7],[146,2,146,3],[146,4,146,5],[146,6,146,7],[147,2,147,3],[147,4,147,5],[147,6,147,7],[138,2,138,3],[138,4,138,5],[138,6,138,7],[139,0,139,1]]}
["\nCOMANDO DA AERONÁUTICA\nFICHA INFORMATIVA DE AERÓDROMOS\nAnexo A à ICA 63-19"]
[]
["Características do Aeródromo"]
[]
["A"," Dados Gerais do Aeródromo:"]
["A1","Denominação do Aeródromo:",{"$f":"'DADOS GERAIS-A'!C2","v":"Comandante Antônio Amilton Beraldo"}]
["A2","Código OACI:",{"$f":"'DADOS GERAIS-A'!C3","v":"SSZW"}]
["A3","ARP (Latitude):",{"$f":"'DADOS GERAIS-A'!C4*10000+'DADOS GERAIS-A'!C5*100+'DADOS GERAIS-A'!C6","v":251104}]
["A4","ARP (Longitude):",{"$f":"'DADOS GERAIS-A'!C8*10000+'DADOS GERAIS-A'!C9*100+'DADOS GERAIS-A'!C10","v":500838}]
["A5","Elevação (m):",{"$f":"FORMULÁRIO!$C$7","v":787.71}]
["B","Dados Gerais da(s) Pista(s):","PISTA 1",null,"PISTA 2",null,"PISTA 3"]
["B1","Designação:",8]
[null,null,26]
["B2","Comprimento (m):",{"$f":"FORMULÁRIO!C13","v":1280.4231856208191}]
["B3","Largura (m):",{"$f":"FORMULÁRIO!C14","v":30}]
["B4","Comprimento da Faixa de Pista (m):",{"$f":"FORMULÁRIO!C17","v":1400.4231856208191}]
["B5","Largura da Faixa de Pista (m):",{"$f":"FORMULÁRIO!C16","v":150}]
["B6","Período de Operação:",{"$f":"FORMULÁRIO!C18","v":"Diurno e Noturno"}]
["C","Dados da Cabeceira Menor:","PISTA 1",null,"PISTA 2",null,"PISTA 3"]
["C1","Número:",{"$f":"C12","v":8}]
["C2","Rumo verdadeiro:",{"$f":"FORMULÁRIO!C21*10000+FORMULÁRIO!D21*100+FORMULÁRIO!E21","v":585410.5406347533}]
["C3","Coordenadas geográficas (latitude):",{"$f":"FORMULÁRIO!C22*10000+FORMULÁRIO!D22*100+FORMULÁRIO!E22","v":251113.41}]
["C4","Coordenadas geográficas (longitude):",{"$f":"FORMULÁRIO!C23*10000+FORMULÁRIO!D23*100+FORMULÁRIO!E23","v":500855.02}]
["C5","Elevação (m):",{"$f":"FORMULÁRIO!C24","v":787.71}]
["C6","Código de Referência POUSO:",{"$f":"FORMULÁRIO!C26","v":3}]
["C7","Código de Referência DECOLAGEM:",{"$f":"FORMULÁRIO!C29","v":3}]
["C8","Letra de Código de Referência:",{"$f":"FORMULÁRIO!F12","v":"C"}]
["C9","Tipo de utilização:",{"$f":"FORMULÁRIO!C25","v":"Pouso e Decolagem"}]
["C10","Tipo de operação para pouso:",{"$f":"FORMULÁRIO!C27","v":"VFR"}]
["C11","Tipo de operação para decolagem:",{"$f":"FORMULÁRIO!C30","v":"VFR"}]
["C12","Zona de parada:",{"$f":"FORMULÁRIO!C39","v":0}]
["C13","Comprimento (m):",{"$f":"FORMULÁRIO!C40","v":0}]
["C14","Largura (m):",{"$f":"FORMULÁRIO!C41","v":0}]
["C15","Zona desimpedida:",{"$f":"FORMULÁRIO!C42","v":0}]
["C16","Comprimento (m):",{"$f":"FORMULÁRIO!C43","v":0}]
["C17","Largura (m):",{"$f":"FORMULÁRIO!C44","v":0}]
["D"," Dados da Cabeceira Maior:","PISTA 1",null,"PISTA 2",null,"PISTA 3"]
["D1","Número:",{"$f":"C13","v":26}]
["D2","Rumo verdadeiro:",{"$f":"FORMULÁRIO!F21*10000+FORMULÁRIO!G21*100+FORMULÁRIO!H21","v":2385410.5406347532}]
["D3","Coordenadas geográficas (latitude):",{"$f":"FORMULÁRIO!F22*10000+FORMULÁRIO!G22*100+FORMULÁRIO!H22","v":251051.91}]
["D4","Coordenadas geográficas (longitude):",{"$f":"FORMULÁRIO!F23*10000+FORMULÁRIO!G23*100+FORMULÁRIO!H23","v":500815.87}]
["D5","Elevação (m):",{"$f":"FORMULÁRIO!F24","v":786.37900000000002}]
["D6","Código de Referência POUSO:",{"$f":"FORMULÁRIO!F26","v":3}]
["D7","Código de Referência DECOLAGEM:",{"$f":"FORMULÁRIO!F29","v":3}]
["D8","Letra de Código de Referência:",{"$f":"FORMULÁRIO!F12","v":"C"}]
["D9","Tipo de utilização:",{"$f":"FORMULÁRIO!F25","v":"Pouso e Decolagem"}]
["D10","Tipo de operação para pouso:",{"$f":"FORMULÁRIO!F27","v":"VFR"}]
["D11","Tipo de operação para decolagem:",{"$f":"FORMULÁRIO!F30","v":"VFR"}]
["D12","Zona de parada:",{"$f":"FORMULÁRIO!F39","v":0}]
["D13","Comprimento (m):",{"$f":"FORMULÁRIO!F40","v":0}]
["D14","Largura (m):",{"$f":"FORMULÁRIO!F41","v":0}]
["D15","Zona desimpedida:",{"$f":"FORMULÁRIO!F42","v":0}]
["D16","Comprimento (m):",{"$f":"FORMULÁRIO!F43","v":0}]
["D17","Largura (m):",{"$f":"FORMULÁRIO!F44","v":0}]
[]
["Características das Superfícies Limitadoras de Obstáculos"]
[]
["E","Superfície de Aproximação:","CAB 1","CAB 2","CAB 3","CAB 4","CAB 5","CAB 6"]
["E1","Divergência lado direito (%):",{"$f":"FORMULÁRIO!C48","v":0},{"$f":"FORMULÁRIO!F48","v":0}]
["E2","Divergência lado esquerdo (%):",{"$f":"FORMULÁRIO!C49","v":0},{"$f":"FORMULÁRIO!F49","v":0}]
["E3","Comprimento total (m):",{"$f":"FORMULÁRIO!C50","v":3000},{"$f":"FORMULÁRIO!F50","v":3000}]
[null,"Primeira Seção"]
["E4","Largura da borda interna (m):",{"$f":"FORMULÁRIO!C52","v":150},{"$f":"FORMULÁRIO!F52","v":150}]
["E5","Elevação da borda interna (m):",{"$f":"FORMULÁRIO!C53","v":787.71},{"$f":"FORMULÁRIO!F53","v":786.37900000000002}]
["E6","Distância da cabeceira (m):",{"$f":"FORMULÁRIO!C54","v":60},{"$f":"FORMULÁRIO!F54","v":60}]
["E7","Abertura total lado direito (%):",{"$f":"FORMULÁRIO!C55","v":0.1},{"$f":"FORMULÁRIO!F55","v":0.1}]
["E8","Abertura total lado esquerdo (%):",{"$f":"FORMULÁRIO!C56","v":0.1},{"$f":"FORMULÁRIO!F56","v":0.1}]
["E9","Comprimento (m):",{"$f":"FORMULÁRIO!C57","v":3000},{"$f":"FORMULÁRIO!F57","v":3000}]
["E10","Gradiente (%):",{"$f":"FORMULÁRIO!C58","v":3.3300000000000003E-2},{"$f":"FORMULÁRIO!F58","v":3.3300000000000003E-2}]
["E11","Elevação da borda externa (m):",{"$f":"FORMULÁRIO!C59","v":887.61},{"$f":"FORMULÁRIO!F59","v":886.279}]
[null,"Segunda Seção"]
["E12","Largura da borda interna (m):",{"$f":"FORMULÁRIO!C61","v":"NA"},{"$f":"FORMULÁRIO!F61","v":"NA"}]
["E13","Elevação da borda interna (m):",{"$f":"FORMULÁRIO!C62","v":"NA"},{"$f":"FORMULÁRIO!F62","v":"NA"}]
["E14","Abertura total lado direito (%):",{"$f":"FORMULÁRIO!C63","v":"NA"},{"$f":"FORMULÁRIO!F63","v":"NA"}]
["E15","Abertura total lado esquerdo (%):",{"$f":"FORMULÁRIO!C64","v":"NA"},{"$f":"FORMULÁRIO!F64","v":"NA"}]
["E16","Comprimento (m):",{"$f":"FORMULÁRIO!C65","v":"NA"},{"$f":"FORMULÁRIO!F65","v":"NA"}]
["E17","Gradiente (%):",{"$f":"FORMULÁRIO!C66","v":"NA"},{"$f":"FORMULÁRIO!F66","v":"NA"}]
["E18","Elevação da borda externa (m):",{"$f":"FORMULÁRIO!C67","v":"NA"},{"$f":"FORMULÁRIO!F67","v":"NA"}]
[null,"Seção Horizontal"]
["E19","Largura da borda interna (m):",{"$f":"FORMULÁRIO!C69","v":"NA"},{"$f":"FORMULÁRIO!F69","v":"NA"}]
["E20","Abertura total lado direito (%):",{"$f":"FORMULÁRIO!C70","v":"NA"},{"$f":"FORMULÁRIO!F70","v":"NA"}]
["E21","Abertura total lado esquerdo (%):",{"$f":"FORMULÁRIO!C71","v":"NA"},{"$f":"FORMULÁRIO!F71","v":"NA"}]
["E22","Comprimento (m):",{"$f":"FORMULÁRIO!C72","v":"NA"},{"$f":"FORMULÁRIO!F72","v":"NA"}]
["E23","Elevação (m):",{"$f":"FORMULÁRIO!C73","v":"NA"},{"$f":"FORMULÁRIO!F73","v":"NA"}]
["F","Superfície de Decolagem:","CAB 1","CAB 2"]
["F1","Largura da borda interna (m):",{"$f":"FORMULÁRIO!C75","v":180},{"$f":"FORMULÁRIO!F75","v":180}]
["F2","Elevação da borda interna (m):",{"$f":"FORMULÁRIO!C76","v":786.37900000000002},{"$f":"FORMULÁRIO!F76","v":787.71}]
["F3","Distância da cabeceira oposta (m):",{"$f":"FORMULÁRIO!C77","v":60},{"$f":"FORMULÁRIO!F77","v":60}]
["F4","Abertura para cada lado (%):",{"$f":"FORMULÁRIO!C78","v":0.125},{"$f":"FORMULÁRIO!F78","v":0.125}]
["F5","Largura final (m):",{"$f":"FORMULÁRIO!C79","v":1200},{"$f":"FORMULÁRIO!F79","v":1200}]
["F6","Comprimento (m):",{"$f":"FORMULÁRIO!C80","v":15000},{"$f":"FORMULÁRIO!F80","v":15000}]
["F7","Gradiente (%):",{"$f":"FORMULÁRIO!C81","v":0.02},{"$f":"FORMULÁRIO!F81","v":0.02}]
["F8","Elevação da borda externa (m):",{"$f":"FORMULÁRIO!C82","v":1086.3789999999999},{"$f":"FORMULÁRIO!F82","v":1087.71}]
["G","Superfície de Aprox. Interna:","CAB 1","CAB 2"]
["G1","Largura da borda interna (m):",{"$f":"FORMULÁRIO!C84","v":"NA"},{"$f":"FORMULÁRIO!F84","v":"NA"}]
["G2","Elevação da borda interna (m):",{"$f":"FORMULÁRIO!C85","v":"NA"},{"$f":"FORMULÁRIO!F85","v":"NA"}]
["G3","Distância da cabeceira (m):",{"$f":"FORMULÁRIO!C86","v":"NA"},{"$f":"FORMULÁRIO!F86","v":"NA"}]
["G4","Abertura para cada lado (%):",{"$f":"FORMULÁRIO!C87","v":"NA"},{"$f":"FORMULÁRIO!F87","v":"NA"}]
["G5","Comprimento (m):",{"$f":"FORMULÁRIO!C88","v":"NA"},{"$f":"FORMULÁRIO!F88","v":"NA"}]
["G6","Gradiente (%):",{"$f":"FORMULÁRIO!C89","v":"NA"},{"$f":"FORMULÁRIO!F89","v":"NA"}]
["G7","Elevação da borda externa (m):",{"$f":"FORMULÁRIO!C90","v":"NA"},{"$f":"FORMULÁRIO!F90","v":"NA"}]
["H","Superfície de Transição Interna:","CAB 1","CAB 2"]
["H1","Gradiente (%):",{"$f":"FORMULÁRIO!C92","v":"NA"},{"$f":"FORMULÁRIO!F92","v":"NA"}]
["H2","Elevação da borda superior (m):",{"$f":"FORMULÁRIO!C93","v":"NA"},{"$f":"FORMULÁRIO!F93","v":"NA"}]
["I","Superfície de Pouso Interrompido:","CAB 1","CAB 2"]
["I1","Largura da borda interna (m):",{"$f":"FORMULÁRIO!C95","v":"NA"},{"$f":"FORMULÁRIO!F95","v":"NA"}]
["I2","Elevação da borda interna (m):",{"$f":"FORMULÁRIO!C96","v":"NA"},{"$f":"FORMULÁRIO!F96","v":"NA"}]
["I3","Distância da cabeceira (m):",{"$f":"FORMULÁRIO!C97","v":"NA"},{"$f":"FORMULÁRIO!F97","v":"NA"}]
["I4","Abertura para cada lado (%):",{"$f":"FORMULÁRIO!C98","v":"NA"},{"$f":"FORMULÁRIO!F98","v":"NA"}]
["I5","Gradiente (%):",{"$f":"FORMULÁRIO!C99","v":"NA"},{"$f":"FORMULÁRIO!F99","v":"NA"}]
["I6","Elevação da borda externa (m):",{"$f":"FORMULÁRIO!C100","v":"NA"},{"$f":"FORMULÁRIO!F100","v":"NA"}]
["J","Superfície de Transição:","Pista 1",null,"Pista 2",null,"Pista 3"]
["J1","Gradiente (%):",{"$f":"FORMULÁRIO!C102","v":0.14299999999999999}]
["K","Superfície Horizontal Interna:","Pista 1"]
["K1","Altitude (m):",{"$f":"FORMULÁRIO!C104","v":832.71}]
["K2","Raio (m)",{"$f":"FORMULÁRIO!C105","v":4000}]
["L","Superfície Cônica:","Pista 1"]
["L1","Altitude (m):",{"$f":"FORMULÁRIO!C107","v":907.71}]
["L2","Gradiente (%):",{"$f":"FORMULÁRIO!C108","v":0.05}]
["M","Superfície Horizontal Externa:","Pista 1"]
["M1","Raio (m):",{"$f":"FORMULÁRIO!C110","v":"NA"}]
["M2","Altitude (m):",{"$f":"FORMULÁRIO!C111","v":"NA"}]
["N","Superfície de Prot Voo Visual:","Pista 1"]
["N1","Área 1:",{"$f":"FORMULÁRIO!C113","v":"Aplicável"}]
["N2","Largura (m):",{"$f":"FORMULÁRIO!C114","v":2350}]
["N3","Buffer (m):",{"$f":"FORMULÁRIO!C115","v":470}]
["N4","Comprimento (m):",{"$f":"FORMULÁRIO!C116","v":2350}]
[null,null,"CAB 1","CAB 2","CAB 3","CAB 4","CAB 5","CAB 6"]
["N5","Altitude seção de través (m):",{"$f":"FORMULÁRIO!C118","v":863.50907339673256},{"$f":"FORMULÁRIO!F118","v":863.50907339673256}]
["N6","Altitude seção de aprox/dep (m):",{"$f":"FORMULÁRIO!C119","v":840.64879541575226},{"$f":"FORMULÁRIO!F119","v":840.64879541575226}]
[null,null,"CAB 1","CAB 2"]
["N7","Curvas:",{"$f":"FORMULÁRIO!C121","v":"Ambas"},{"$f":"FORMULÁRIO!F121","v":"Ambas"}]
["N8","Altura mínima do circuito de tráfego:",{"$f":"FORMULÁRIO!C122","v":152},{"$f":"FORMULÁRIO!F122","v":152}]
[null,null,"Pista 1",null,"Pista 2",null,"Pista 3"]
["N9","Área 2:",{"$f":"FORMULÁRIO!C124","v":"Aplicável"}]
["N10","Categoria de performance crítica:",{"$f":"FORMULÁRIO!C125","v":"C"}]
["N11","Largura (m):",{"$f":"FORMULÁRIO!C126","v":4170}]
["N12","Buffer (m):",{"$f":"FORMULÁRIO!C127","v":930}]
["N13","Comprimento (m):",{"$f":"FORMULÁRIO!C128","v":4170}]
[null,null,"CAB 1","CAB 2","CAB 3","CAB 4","CAB 5","CAB 6"]
["N14","Altitude seção través (m):",{"$f":"FORMULÁRIO!C130","v":940.30814679346508},{"$f":"FORMULÁRIO!F130","v":940.30814679346508}]
["N15","Altitude seção aprox/dep (m):",{"$f":"FORMULÁRIO!C131","v":894.5875908315046},{"$f":"FORMULÁRIO!F131","v":894.5875908315046}]
[null,null,"CAB 1","CAB 2","CAB 3","CAB 4","CAB 5","CAB 6"]
["N16","Curvas:",{"$f":"FORMULÁRIO!C133","v":"Ambas"},{"$f":"FORMULÁRIO!F133","v":"Ambas"},{"$f":"FORMULÁRIO!I133","v":0},{"$f":"FORMULÁRIO!L133","v":0},{"$f":"FORMULÁRIO!O133","v":0},{"$f":"FORMULÁRIO!R133","v":0}]
["N17","Altura mínima do circ. de tráfego:",{"$f":"FORMULÁRIO!C134","v":305},{"$f":"FORMULÁRIO!F134","v":305},{"$f":"FORMULÁRIO!I134","v":0},{"$f":"FORMULÁRIO!L134","v":0},{"$f":"FORMULÁRIO!O134","v":0},{"$f":"FORMULÁRIO!R134","v":0}]
[null,null,"Pista 1",null,"Pista 2",null,"Pista 3"]
["N18","Área 3:",{"$f":"FORMULÁRIO!C136","v":"NA"}]
["N19","Largura (m):",{"$f":"FORMULÁRIO!C137","v":"NA"}]
["N20","Buffer (m):",{"$f":"FORMULÁRIO!C138","v":"NA"}]
["N21","Comprimento (m):",{"$f":"FORMULÁRIO!C139","v":"NA"}]
["N22","Altitude seção través (m):",{"$f":"FORMULÁRIO!C140","v":"NA"}]
["N23","Altitude seção aprox/dep (m):",{"$f":"FORMULÁRIO!C141","v":"NA"}]
[null,null,"CAB 1","CAB 2","CAB 3","CAB 4","CAB 5","CAB 6"]
["N24","Curvas:",{"$f":"FORMULÁRIO!C143","v":0},{"$f":"FORMULÁRIO!F143","v":0}]

{"sheet":"FORMULÁRIO","index":1,"n_rows":143,"n_cols":36,"rows_kept":143,"cut":false,"hidden":true,"merged":[[78,2,78,4],[79,2,79,4],[80,2,80,4],[81,2,81,4],[44,5,44,7],[43,2,43,4],[75,2,75,4],[76,2,76,4],[77,2,77,4],[45,1,45,4],[63,5,63,7],[64,5,64,7],[65,5,65,7],[66,5,66,7],[47,2,47,4],[63,2,63,4],[57,2,57,4],[69,2,69,4],[70,2,70,4],[71,2,71,4],[64,2,64,4],[65,2,65,4],[56,2,56,4],[62,2,62,4],[67,2,67,4],[68,2,68,4],[60,2,60,4],[61,2,61,4],[52,2,52,4],[53,2,53,4],[54,2,54,4],[13,2,13,7],[39,5,39,7],[40,5,40,7],[41,5,41,7],[42,5,42,7],[43,5,43,7],[44,2,44,4],[48,2,48,4],[49,2,49,4],[50,2,50,4],[38,5,38,7],[55,5,55,7],[56,5,56,7],[57,5,57,7],[58,5,58,7],[59,5,59,7],[60,5,60,7],[74,2,74,4],[18,5,18,7],[18,2,18,4],[19,5,19,7],[19,2,19,4],[38,2,38,4],[39,2,39,4],[40,2,40,4],[41,2,41,4],[42,2,42,4],[51,2,51,4],[72,2,72,4],[47,5,47,7],[48,5,48,7],[49,5,49,7],[51,5,51,7],[52,5,52,7],[61,5,61,7],[66,2,66,4],[62,5,62,7],[58,2,58,4],[59,2,59,4],[70,5,70,7],[71,5,71,7],[84,2,84,4],[85,2,85,4],[46,2,46,4],[46,5,46,7],[73,2,73,4],[73,5,73,7],[82,2,82,4],[82,5,82,7],[77,5,77,7],[78,5,78,7],[79,5,79,7],[80,5,80,7],[81,5,81,7],[72,5,72,7],[50,5,50,7],[74,5,74,7],[75,5,75,7],[76,5,76,7],[67,5,67,7],[68,5,68,7],[69,5,69,7],[55,2,55,4],[53,5,53,7],[54,5,54,7],[91,2,91,4],[92,2,92,4],[91,5,91,7],[92,5,92,7],[94,2,94,4],[94,5,94,7],[11,5,11,7],[83,5,83,7],[84,5,84,7],[85,5,85,7],[86,5,86,7],[86,2,86,4],[87,2,87,4],[88,2,88,4],[89,2,89,4],[17,2,17,7],[87,5,87,7],[88,5,88,7],[89,5,89,7],[90,2,90,4],[90,5,90,7],[93,2,93,4],[93,5,93,7],[83,2,83,4],[100,2,100,7],[102,2,102,7],[105,2,105,7],[95,5,95,7],[96,5,96,7],[97,5,97,7],[98,5,98,7],[99,5,99,7],[95,2,95,4],[96,2,96,4],[97,2,97,4],[98,2,98,4],[99,2,99,4],[108,2,108,7],[111,2,111,7],[101,2,101,7],[103,2,103,7],[104,2,104,7],[106,2,106,7],[107,2,107,7],[109,2,109,7],[110,2,110,7],[119,2,119,4],[119,5,119,7],[120,2,120,4],[120,5,120,7],[112,2,112,7],[113,2,113,7],[114,2,114,7],[115,2,115,7],[116,2,116,4],[116,5,116,7],[133,2,133,4],[133,5,133,7],[117,5,117,7],[118,5,118,7],[131,2,131,4],[131,5,131,7],[129,2,129,4],[129,5,129,7],[130,2,130,4],[130,5,130,7],[132,2,132,4],[132,5,132,7],[125,2,125,7],[126,2,126,7],[127,2,127,7],[128,2,128,4],[128,5,128,7],[121,2,121,4],[121,5,121,7],[122,2,122,7],[123,2,123,7],[124,2,124,7],[117,2,117,4],[118,2,118,4],[142,2,142,4],[142,5,142,7],[141,2,141,4],[141,5,141,7],[134,2,134,7],[135,2,135,7],[136,2,136,7],[137,2,137,7],[138,2,138,7],[139,2,139,7],[140,2,140,7],[46,8,46,10],[46,11,46,13],[47,8,47,10],[47,11,47,13],[38,8,38,10],[38,11,38,13],[39,8,39,10],[39,11,39,13],[40,8,40,10],[40,11,40,13],[41,8,41,10],[41,11,41,13],[42,8,42,10],[42,11,42,13],[48,8,48,10],[48,11,48,13],[49,8,49,10],[49,11,49,13],[50,8,50,10],[50,11,50,13],[51,8,51,10],[51,11,51,13],[52,8,52,10],[52,11,52,13],[53,8,53,10],[53,11,53,13],[54,8,54,10],[54,11,54,13],[55,8,55,10],[55,11,55,13],[56,8,56,10],[56,11,56,13],[57,8,57,10],[57,11,57,13],[58,8,58,10],[58,11,58,13],[59,8,59,10],[59,11,59,13],[60,8,60,10],[60,11,60,13],[61,8,61,10],[61,11,61,13],[62,8,62,10],[62,11,62,13],[63,8,63,10],[63,11,63,13],[64,8,64,10],[64,11,64,13],[65,8,65,10],[65,11,65,13],[66,8,66,10],[66,11,66,13],[67,8,67,10],[67,11,67,13],[68,8,68,10],[68,11,68,13],[69,8,69,10],[69,11,69,13],[70,8,70,10],[70,11,70,13],[71,8,71,10],[71,11,71,13],[72,8,72,10],[72,11,72,13],[73,8,73,10],[73,11,73,13],[74,8,74,10],[74,11,74,13],[75,8,75,10],[75,11,75,13],[76,8,76,10],[76,11,76,13],[77,8,77,10],[77,11,77,13],[78,8,78,10],[78,11,78,13],[79,8,79,10],[79,11,79,13],[80,8,80,10],[80,11,80,13],[81,8,81,10],[81,11,81,13],[82,8,82,10],[82,11,82,13],[83,8,83,10],[83,11,83,13],[84,8,84,10],[84,11,84,13],[85,8,85,10],[85,11,85,13],[86,8,86,10],[86,11,86,13],[87,8,87,10],[87,11,87,13],[88,8,88,10],[88,11,88,13],[89,8,89,10],[89,11,89,13],[90,8,90,10],[90,11,90,13],[91,8,91,10],[91,11,91,13],[92,8,92,10],[92,11,92,13],[93,8,93,10],[93,11,93,13],[94,8,94,10],[94,11,94,13],[95,8,95,10],[95,11,95,13],[96,8,96,10],[96,11,96,13],[97,8,97,10],[97,11,97,13],[98,8,98,10],[98,11,98,13],[99,8,99,10],[99,11,99,13],[100,8,100,13],[101,8,101,13],[102,8,102,13],[103,8,103,13],[104,8,104,13],[119,11,119,13],[105,8,105,13],[106,8,106,13],[107,8,107,13],[108,8,108,13],[109,8,109,13],[110,8,110,13],[111,8,111,13],[112,8,112,13],[113,8,113,13],[1,2,1,13],[132,8,132,10],[132,11,132,13],[133,8,133,10],[133,11,133,13],[134,8,134,13],[135,8,135,13],[136,8,136,13],[137,8,137,13],[127,8,127,13],[128,8,128,10],[128,11,128,13],[129,8,129,10],[129,11,129,13],[130,8,130,10],[14,2,14,7],[14,8,14,13],[130,11,130,13],[131,8,131,10],[131,11,131,13],[120,8,120,10],[120,11,120,13],[121,8,121,10],[121,11,121,13],[44,14,44,16],[44,17,44,19],[46,14,46,16],[139,8,139,13],[140,8,140,13],[141,8,141,10],[141,11,141,13],[142,8,142,10],[142,11,142,13],[138,8,138,13],[122,8,122,13],[123,8,123,13],[124,8,124,13],[125,8,125,13],[126,8,126,13],[114,8,114,13],[115,8,115,13],[116,8,116,10],[116,11,116,13],[117,8,117,10],[117,11,117,13],[118,8,118,10],[118,11,118,13],[119,8,119,10],[8,14,8,19],[9,14,9,19],[10,14,10,19],[44,26,44,30],[44,31,44,34],[31,2,31,4],[31,5,31,7],[31,8,31,10],[31,11,31,13],[43,8,43,10],[43,11,43,13],[44,8,44,10],[44,11,44,13],[38,14,38,16],[38,17,38,19],[39,14,39,16],[39,17,39,19],[40,14,40,16],[40,17,40,19],[41,14,41,16],[31,14,31,16],[31,17,31,19],[43,14,43,16],[43,17,43,19],[8,2,8,7],[8,8,8,13],[18,8,18,10],[18,11,18,13],[19,8,19,10],[19,11,19,13],[9,8,9,13],[10,8,10,13],[11,8,11,10],[11,11,11,13],[12,8,12,13],[13,8,13,13],[15,8,15,13],[16,8,16,13],[17,8,17,13],[9,2,9,7],[10,2,10,7],[12,2,12,7],[15,2,15,7],[16,2,16,7],[11,2,11,4],[11,14,11,16],[11,17,11,19],[12,14,12,19],[13,14,13,19],[15,14,15,19],[16,14,16,19],[41,17,41,19],[42,14,42,16],[42,17,42,19],[14,14,14,19],[18,14,18,16],[18,17,18,19],[19,14,19,16],[19,17,19,19],[17,14,17,19],[46,17,46,19],[47,14,47,16],[47,17,47,19],[48,14,48,16],[48,17,48,19],[49,14,49,16],[49,17,49,19],[50,14,50,16],[50,17,50,19],[51,14,51,16],[51,17,51,19],[52,14,52,16],[52,17,52,19],[53,14,53,16],[53,17,53,19],[54,14,54,16],[54,17,54,19],[55,14,55,16],[55,17,55,19],[56,14,56,16],[56,17,56,19],[57,14,57,16],[57,17,57,19],[58,14,58,16],[58,17,58,19],[59,14,59,16],[59,17,59,19],[60,14,60,16],[60,17,60,19],[61,14,61,16],[61,17,61,19],[62,14,62,16],[62,17,62,19],[63,14,63,16],[63,17,63,19],[64,14,64,16],[64,17,64,19],[65,14,65,16],[65,17,65,19],[66,14,66,16],[66,17,66,19],[67,14,67,16],[67,17,67,19],[68,14,68,16],[68,17,68,19],[69,14,69,16],[69,17,69,19],[70,14,70,16],[70,17,70,19],[71,14,71,16],[71,17,71,19],[72,14,72,16],[72,17,72,19],[73,14,73,16],[73,17,73,19],[74,14,74,16],[74,17,74,19],[75,14,75,16],[75,17,75,19],[76,14,76,16],[76,17,76,19],[77,14,77,16],[77,17,77,19],[78,14,78,16],[78,17,78,19],[79,14,79,16],[79,17,79,19],[80,14,80,16],[80,17,80,19],[81,14,81,16],[81,17,81,19],[82,14,82,16],[82,17,82,19],[83,14,83,16],[83,17,83,19],[84,14,84,16],[84,17,84,19],[85,14,85,16],[85,17,85,19],[86,14,86,16],[86,17,86,19],[87,14,87,16],[87,17,87,19],[88,14,88,16],[88,17,88,19],[89,14,89,16],[89,17,89,19],[90,14,90,16],[90,17,90,19],[91,14,91,16],[91,17,91,19],[92,14,92,16],[92,17,92,19],[93,14,93,16],[93,17,93,19],[94,14,94,16],[94,17,94,19],[95,14,95,16],[95,17,95,19],[96,14,96,16],[96,17,96,19],[97,14,97,16],[97,17,97,19],[98,14,98,16],[98,17,98,19],[99,14,99,16],[99,17,99,19],[100,14,100,19],[101,14,101,19],[102,14,102,19],[103,14,103,19],[104,14,104,19],[105,14,105,19],[106,14,106,19],[107,14,107,19],[108,14,108,19],[109,14,109,19],[110,14,110,19],[111,14,111,19],[122,14,122,19],[123,14,123,19],[124,14,124,19],[112,14,112,19],[113,14,113,19],[114,14,114,19],[115,14,115,19],[116,14,116,16],[116,17,116,19],[117,14,117,16],[117,17,117,19],[118,14,118,16],[118,17,118,19],[119,14,119,16],[119,17,119,19],[120,14,120,16],[120,17,120,19],[121,14,121,16],[121,17,121,19],[142,14,142,16],[142,17,142,19],[131,14,131,16],[131,17,131,19],[132,14,132,16],[132,17,132,19],[133,14,133,16],[133,17,133,19],[134,14,134,19],[135,14,135,19],[136,14,136,19],[137,14,137,19],[138,14,138,19],[139,14,139,19],[140,14,140,19],[141,14,141,16],[141,17,141,19],[125,14,125,19],[126,14,126,19],[127,14,127,19],[128,14,128,16],[128,17,128,19],[129,14,129,16],[129,17,129,19],[130,14,130,16],[130,17,130,19]]}
[]
[null," Dados Gerais do Aeródromo:"]
[]
[null,null,null,null,null,null,null,null,null,null,null,null,null,null,null,null,null,null,null,null,null,null,null,null,null,null,{"$f":"IF(AA5<180,AA5+180,AA5-180)","v":238.90292795409812},{"$f":"IF(AB5<180,AB5+180,AB5-180)","v":180},{"$f":"IF(AC5<180,AC5+180,AC5-180)","v":180}]
[null,null,null,null,null,null,null,null,null,null,null,null,null,null,null,null,null,null,null,null,null,null,"SIM","Diurno",1,"A",{"$f":"calculo!C2","v":58.902927954098132},{"$f":"calculo!C14","v":0},{"$f":"calculo!C26","v":0},"Pouso","NA","Aplicável",75,"Esquerda",152,305]
[null,null,null,null,null,null,null,null,null,null,null,null,null,null,null,null,null,null,null,null,null,null,"NÃO","Noturno",2,"B",{"$f":"AA5-INT(AA5)","v":0.90292795409813209},{"$f":"AB5-INT(AB5)","v":0},{"$f":"AC5-INT(AC5)","v":0},"Decolagem","VFR","NA",90,"Direita",183,335]
[null,"Elevação:",{"$f":"IF(O15=0,IF(I15=0,C15,MAX(C16:T16)),MAX(C16:T16))","v":787.71},null,null,null,null,null,null,null,null,null,null,null,null,null,null,null,null,null,null,null,{"$f":"AE5","v":"NA"},"Diurno e Noturno",3,"C",{"$f":"AA6*60","v":54.175677245887925},{"$f":"AB6*60","v":0},{"$f":"AC6*60","v":0},"Pouso e Decolagem","IFR NPA",null,null,"Ambas","NA",366]
[null,"Declinação magnética",18.82,null,null,null,null,null,null,null,null,null,null,null,null,null,null,null,null,null,null,null,null,null,4,"D",{"$f":"(AA7-INT(AA7))*60","v":10.540634753275526},{"$f":"(AB7-INT(AB7))*60","v":0},{"$f":"(AC7-INT(AC7))*60","v":0},null,"IFR PA CAT I",null,null,"NA",null,396]
[null,"Dados Gerais da(s) Pista(s):","PISTA 1",null,null,null,null,null,"PISTA 2",null,null,null,null,null,"PISTA 3",null,null,null,null,null,null,null,null,null,"NA","E",{"$f":"(AA5-$C$8)/10","v":4.0082927954098135},{"$f":"(AB5-$C$8)/10","v":-1.8820000000000001},{"$f":"(AC5-$C$8)/10","v":-1.8820000000000001},null,"IFR PA CAT II",null,null,null,null,427]
[null,"Designação:",{"$f":"C20","v":4.0082927954098135},null,null,null,null,null,{"$f":"I20","v":-1.8820000000000001},null,null,null,null,null,{"$f":"O20","v":-1.8820000000000001},null,null,null,null,null,null,null,null,null,null,"F",null,null,null,null,"IFR PA CAT IIIa",null,null,null,null,457]
[null,null,{"$f":"F20","v":22.008292795409815},null,null,null,null,null,{"$f":"L20","v":16.117999999999999},null,null,null,null,null,{"$f":"R20","v":16.117999999999999},null,null,null,null,null,null,null,null,null,null,"A",null,null,null,null,"IFR PA CAT IIIb",null,null,null,null,"NA"]
[null,"Código de Referência do Aeródromo:",{"$f":"MAX(C26,F26,C29,F29)","v":3},null,null,"C",null,null,{"$f":"MAX(I26,L26,I29,L29)","v":0},null,null,null,null,null,{"$f":"MAX(O26,R26,O29,R29)","v":0},null,null,null,null,null,null,null,null,null,null,"B",null,null,null,null,"IFR PA CAT IIIc"]
[null,"Comprimento:",{"$f":"calculo!B2","v":1280.4231856208191},null,null,null,null,null,{"$f":"calculo!B14","v":0.1},null,null,null,null,null,{"$f":"calculo!B26","v":0.1},null,null,null,null,null,null,null,null,null,null,"C"]
[null,"Largura:",30,null,null,null,null,null,null,null,null,null,null,null,null,null,null,null,null,null,null,null,null,null,null,"NA"]
[null,"Maior elevação da pista",787.71]
[null,"Largura da Faixa de Pista (m):",{"$f":"PISTA!B8","v":150},null,null,null,null,null,{"$f":"PISTA!C8","v":150},null,null,null,null,null,{"$f":"PISTA!D8","v":150}]
[null,"Comprimento da Faixa de Pista (m):",{"$f":"PISTA!B9","v":1400.4231856208191},null,null,null,null,null,{"$f":"PISTA!C9","v":120.1},null,null,null,null,null,{"$f":"PISTA!D9","v":120.1}]
[null,"Período de Operação:","Diurno e Noturno"]
[null,null,null,null,null,"Cabeceira MAIOR:",null,null,null,null,null,"Cabeceira MAIOR:",null,null,null,null,null,"Cabeceira MAIOR:"]
[null,"Designação",{"$f":"IF(AA5-C8>359.999999,AA9-36,AA9)","v":4.0082927954098135},null,null,{"$f":"C20+18","v":22.008292795409815},null,null,{"$f":"IF(AB5-C8>359.999999,AB9-36,AB9)","v":-1.8820000000000001},null,null,{"$f":"I20+18","v":16.117999999999999},null,null,{"$f":"IF(AC5-C8>359.999999,AC9-36,AC9)","v":-1.8820000000000001},null,null,{"$f":"O20+18","v":16.117999999999999}]
[null,"Rumo verdadeiro",{"$f":"INT(AA5)","v":58},{"$f":"INT(AA7)","v":54},{"$f":"AA8","v":10.540634753275526},{"$f":"IF(C21<180,C21+180,C21-180)","v":238},{"$f":"D21","v":54},{"$f":"E21","v":10.540634753275526},{"$f":"INT(AB5)","v":0},{"$f":"INT(AB7)","v":0},{"$f":"AB8","v":0},{"$f":"IF(I21<180,I21+180,I21-180)","v":180},{"$f":"J21","v":0},{"$f":"K21","v":0},{"$f":"INT(AC5)","v":0},{"$f":"INT(AC7)","v":0},{"$f":"AC8","v":0},{"$f":"IF(O21<180,O21+180,O21-180)","v":180},{"$f":"P21","v":0},{"$f":"Q21","v":0}]
[null,"Coordenadas geográficas (latitude):",25,11,13.41,25,10,51.91]
[null,"Coordenadas geográficas (longitude):",50,8,55.02,50,8,15.87]
[null,"Elevação:",787.71,null,null,786.37900000000002]
[null,"Tipo de utilização:","Pouso e Decolagem",null,null,"Pouso e Decolagem"]
[null,"Código de Referência para POUSO:",3,null,null,3]
[null,"Tipo de operação para POUSO:","VFR",null,null,"VFR"]
[null,{"$f":"IF(OR(C27=\"VFR\",C27=\"IFR NPA\",C27=\"NÃO APLICÁVEL\"),\"NÃO APLICÁVEL\",\"Elevação da borda interna da superfície de pouso interrompido:\")","v":"NÃO APLICÁVEL"},{"$f":"'POUSO INTERROMPIDO'!B9","v":"NA"},{"$f":"IF(OR(C27=\"VFR\",C27=\"IFR NPA\",C27=\"NÃO APLICÁVEL\"),\"NA\",\"da CAB:\")","v":"NA"},null,{"$f":"'POUSO INTERROMPIDO'!E9","v":"NA"},{"$f":"IF(OR(F27=\"VFR\",F27=\"IFR NPA\",F27=\"NÃO APLICÁVEL\"),\"NA\",\"da CAB:\")","v":"NA"},null,{"$f":"'POUSO INTERROMPIDO'!H9","v":180.1},{"$f":"IF(OR(I27=\"VFR\",I27=\"IFR NPA\",I27=\"NÃO APLICÁVEL\"),\"NA\",\"da CAB:\")","v":"da CAB:"},null,{"$f":"'POUSO INTERROMPIDO'!K9","v":180.1},{"$f":"IF(OR(L27=\"VFR\",L27=\"IFR NPA\",L27=\"NÃO APLICÁVEL\"),\"NA\",\"da CAB:\")","v":"da CAB:"},null,{"$f":"'POUSO INTERROMPIDO'!N9","v":180.1},{"$f":"IF(OR(O27=\"VFR\",O27=\"IFR NPA\",O27=\"NÃO APLICÁVEL\"),\"NA\",\"da CAB:\")","v":"da CAB:"},null,{"$f":"'POUSO INTERROMPIDO'!Q9","v":180.1},{"$f":"IF(OR(R27=\"VFR\",R27=\"IFR NPA\",R27=\"NÃO APLICÁVEL\"),\"NA\",\"da CAB:\")","v":"da CAB:"}]
[null,"Código de Referência para DECOLAGEM:",3,null,null,3]
[null,"Tipo de operação para DECOLAGEM:","VFR",null,null,"VFR"]
[null,"Possui Saída por Instrumentos em curva?","NÃO",null,null,"NÃO"]
[null,"PROCEDIMENTOS DE NAVEGAÇÃO AÉREA:","Cabeceira MENOR:",null,null,"Cabeceira MAIOR:",null,null,"Cabeceira MENOR:",null,null,null,null,null,"Cabeceira MENOR:",null,null,"Cabeceira MAIOR:"]
[null,"OCH:"]
[null,"Separação de obstáculos (MOC):"]
[null,"Rumo da Aproximação Final:"]
[null,"OCH:"]
[null,"Separação de obstáculos (MOC):"]
[null,"Rumo da Aproximação Final:"]
[null,"Zona de parada (STOPWAY)"]
[null,"Comprimento:"]
[null,"Largura:"]
[null,"Zona desimpedida (CLEARWAY):"]
[null,"Comprimento:"]
[null,"Largura:"]
[null,"Maior elevação da Faixa de Pista oposta ou da CLEARWAY:"]
[]
[null,"Superfície de Aproximação:","CAB 1",null,null,"CAB 2",null,null,"CAB 3",null,null,"CAB 4",null,null,"CAB 5",null,null,"CAB 6"]
[null,"Divergência lado direito (%):",{"$f":"APROX!B12","v":0},null,null,{"$f":"APROX!E12","v":0},null,null,{"$f":"APROX!H12","v":0},null,null,{"$f":"APROX!K12","v":0},null,null,{"$f":"APROX!N12","v":0},null,null,{"$f":"APROX!Q12","v":0}]
[null,"Divergência lado esquerdo (%):",{"$f":"APROX!B13","v":0},null,null,{"$f":"APROX!E13","v":0},null,null,{"$f":"APROX!H13","v":0},null,null,{"$f":"APROX!K13","v":0},null,null,{"$f":"APROX!N13","v":0},null,null,{"$f":"APROX!Q13","v":0}]
[null,"Comprimento total (m):",{"$f":"APROX!B14","v":3000},null,null,{"$f":"APROX!E14","v":3000},null,null,{"$f":"APROX!H14","v":15000},null,null,{"$f":"APROX!K14","v":15000},null,null,{"$f":"APROX!N14","v":15000},null,null,{"$f":"APROX!Q14","v":15000}]
[null,"Primeira Seção"]
[null,"Largura da borda interna (m):",{"$f":"APROX!B16","v":150},null,null,{"$f":"APROX!E16","v":150},null,null,{"$f":"APROX!H16","v":150},null,null,{"$f":"APROX!K16","v":150},null,null,{"$f":"APROX!N16","v":150},null,null,{"$f":"APROX!Q16","v":150}]
[null,"Elevação da borda interna (m):",{"$f":"APROX!B17","v":787.71},null,null,{"$f":"APROX!E17","v":786.37900000000002},null,null,{"$f":"APROX!H17","v":0},null,null,{"$f":"APROX!K17","v":0},null,null,{"$f":"APROX!N17","v":0},null,null,{"$f":"APROX!Q17","v":0}]
[null,"Distância da cabeceira (m):",{"$f":"APROX!B18","v":60},null,null,{"$f":"APROX!E18","v":60},null,null,{"$f":"APROX!H18","v":60},null,null,{"$f":"APROX!K18","v":60},null,null,{"$f":"APROX!N18","v":60},null,null,{"$f":"APROX!Q18","v":60}]
[null,"Abertura total lado direito (%):",{"$f":"APROX!B19","v":0.1},null,null,{"$f":"APROX!E19","v":0.1},null,null,{"$f":"APROX!H19","v":0.15},null,null,{"$f":"APROX!K19","v":0.15},null,null,{"$f":"APROX!N19","v":0.15},null,null,{"$f":"APROX!Q19","v":0.15}]
[null,"Abertura total lado esquerdo (%):",{"$f":"APROX!B20","v":0.1},null,null,{"$f":"APROX!E20","v":0.1},null,null,{"$f":"APROX!H20","v":0.15},null,null,{"$f":"APROX!K20","v":0.15},null,null,{"$f":"APROX!N20","v":0.15},null,null,{"$f":"APROX!Q20","v":0.15}]
[null,"Comprimento (m):",{"$f":"APROX!B21","v":3000},null,null,{"$f":"APROX!E21","v":3000},null,null,{"$f":"APROX!H21","v":3000},null,null,{"$f":"APROX!K21","v":3000},null,null,{"$f":"APROX!N21","v":3000},null,null,{"$f":"APROX!Q21","v":3000}]
[null,"Gradiente (%):",{"$f":"APROX!B22","v":3.3300000000000003E-2},null,null,{"$f":"APROX!E22","v":3.3300000000000003E-2},null,null,{"$f":"APROX!H22","v":2.5000000000000001E-2},null,null,{"$f":"APROX!K22","v":2.5000000000000001E-2},null,null,{"$f":"APROX!N22","v":2.5000000000000001E-2},null,null,{"$f":"APROX!Q22","v":2.5000000000000001E-2}]
[null,"Elevação da borda externa (m):",{"$f":"APROX!B23","v":887.61},null,null,{"$f":"APROX!E23","v":886.279},null,null,{"$f":"APROX!H23","v":75},null,null,{"$f":"APROX!K23","v":75},null,null,{"$f":"APROX!N23","v":75},null,null,{"$f":"APROX!Q23","v":75}]
[null,"Segunda Seção"]
[null,"Largura da borda interna (m):",{"$f":"APROX!B25","v":"NA"},null,null,{"$f":"APROX!E25","v":"NA"},null,null,{"$f":"APROX!H25","v":1050},null,null,{"$f":"APROX!K25","v":1050},null,null,{"$f":"APROX!N25","v":1050},null,null,{"$f":"APROX!Q25","v":1050}]
[null,"Elevação da borda interna (m):",{"$f":"APROX!B26","v":"NA"},null,null,{"$f":"APROX!E26","v":"NA"},null,null,{"$f":"APROX!H26","v":75},null,null,{"$f":"APROX!K26","v":75},null,null,{"$f":"APROX!N26","v":75},null,null,{"$f":"APROX!Q26","v":75}]
[null,"Abertura total lado direito (%):",{"$f":"APROX!B27","v":"NA"},null,null,{"$f":"APROX!E27","v":"NA"},null,null,{"$f":"APROX!H27","v":0.15},null,null,{"$f":"APROX!K27","v":0.15},null,null,{"$f":"APROX!N27","v":0.15},null,null,{"$f":"APROX!Q27","v":0.15}]
[null,"Abertura total lado esquerdo (%):",{"$f":"APROX!B28","v":"NA"},null,null,{"$f":"APROX!E28","v":"NA"},null,null,{"$f":"APROX!H28","v":0.15},null,null,{"$f":"APROX!K28","v":0.15},null,null,{"$f":"APROX!N28","v":0.15},null,null,{"$f":"APROX!Q28","v":0.15}]
[null,"Comprimento (m):",{"$f":"APROX!B29","v":"NA"},null,null,{"$f":"APROX!E29","v":"NA"},null,null,{"$f":"APROX!H29","v":3600},null,null,{"$f":"APROX!K29","v":3600},null,null,{"$f":"APROX!N29","v":3600},null,null,{"$f":"APROX!Q29","v":3600}]
[null,"Gradiente (%):",{"$f":"APROX!B30","v":"NA"},null,null,{"$f":"APROX!E30","v":"NA"},null,null,{"$f":"APROX!H30","v":0.03},null,null,{"$f":"APROX!K30","v":0.03},null,null,{"$f":"APROX!N30","v":0.03},null,null,{"$f":"APROX!Q30","v":0.03}]
[null,"Elevação da borda externa (m):",{"$f":"APROX!B31","v":"NA"},null,null,{"$f":"APROX!E31","v":"NA"},null,null,{"$f":"APROX!H31","v":183},null,null,{"$f":"APROX!K31","v":183},null,null,{"$f":"APROX!N31","v":183},null,null,{"$f":"APROX!Q31","v":183}]
[null,"Seção Horizontal"]
[null,"Largura da borda interna (m):",{"$f":"APROX!B33","v":"NA"},null,null,{"$f":"APROX!E33","v":"NA"},null,null,{"$f":"APROX!H33","v":2130},null,null,{"$f":"APROX!K33","v":2130},null,null,{"$f":"APROX!N33","v":2130},null,null,{"$f":"APROX!Q33","v":2130}]
[null,"Abertura total lado direito (%):",{"$f":"APROX!B34","v":"NA"},null,null,{"$f":"APROX!E34","v":"NA"},null,null,{"$f":"APROX!H34","v":0.15},null,null,{"$f":"APROX!K34","v":0.15},null,null,{"$f":"APROX!N34","v":0.15},null,null,{"$f":"APROX!Q34","v":0.15}]
[null,"Abertura total lado esquerdo (%):",{"$f":"APROX!B35","v":"NA"},null,null,{"$f":"APROX!E35","v":"NA"},null,null,{"$f":"APROX!H35","v":0.15},null,null,{"$f":"APROX!K35","v":0.15},null,null,{"$f":"APROX!N35","v":0.15},null,null,{"$f":"APROX!Q35","v":0.15}]
[null,"Comprimento (m):",{"$f":"APROX!B36","v":"NA"},null,null,{"$f":"APROX!E36","v":"NA"},null,null,{"$f":"APROX!H36","v":"NA"},null,null,{"$f":"APROX!K36","v":"NA"},null,null,{"$f":"APROX!N36","v":"NA"},null,null,{"$f":"APROX!Q36","v":"NA"}]
[null,"Elevação (m):",{"$f":"APROX!B37","v":"NA"},null,null,{"$f":"APROX!E37","v":"NA"},null,null,{"$f":"APROX!H37","v":183},null,null,{"$f":"APROX!K37","v":183},null,null,{"$f":"APROX!N37","v":183},null,null,{"$f":"APROX!Q37","v":183}]
[null,"Superfície de Decolagem:","CAB 1",null,null,"CAB 2",null,null,"CAB 3",null,null,"CAB 4",null,null,"CAB 5",null,null,"CAB 6"]
[null,"Largura da borda interna (m):",{"$f":"DEC!B7","v":180},null,null,{"$f":"DEC!E7","v":180},null,null,{"$f":"DEC!H7","v":180},null,null,{"$f":"DEC!K7","v":180},null,null,{"$f":"DEC!N7","v":180},null,null,{"$f":"DEC!Q7","v":180}]
[null,"Elevação da borda interna (m):",{"$f":"DEC!B8","v":786.37900000000002},null,null,{"$f":"DEC!E8","v":787.71},null,null,{"$f":"DEC!H8","v":0},null,null,{"$f":"DEC!K8","v":0},null,null,{"$f":"DEC!N8","v":0},null,null,{"$f":"DEC!Q8","v":0}]
[null,"Distância do final da pista (m):",{"$f":"DEC!B9","v":60},null,null,{"$f":"DEC!E9","v":60},null,null,{"$f":"DEC!H9","v":60},null,null,{"$f":"DEC!K9","v":60},null,null,{"$f":"DEC!N9","v":60},null,null,{"$f":"DEC!Q9","v":60}]
[null,"Abertura para cada lado (%):",{"$f":"DEC!B10","v":0.125},null,null,{"$f":"DEC!E10","v":0.125},null,null,{"$f":"DEC!H10","v":0.1},null,null,{"$f":"DEC!K10","v":0.1},null,null,{"$f":"DEC!N10","v":0.1},null,null,{"$f":"DEC!Q10","v":0.1}]
[null,"Largura final (m):",{"$f":"DEC!B11","v":1200},null,null,{"$f":"DEC!E11","v":1200},null,null,{"$f":"DEC!H11","v":1200},null,null,{"$f":"DEC!K11","v":1200},null,null,{"$f":"DEC!N11","v":1200},null,null,{"$f":"DEC!Q11","v":1200}]
[null,"Comprimento (m):",{"$f":"DEC!B12","v":15000},null,null,{"$f":"DEC!E12","v":15000},null,null,{"$f":"DEC!H12","v":15000},null,null,{"$f":"DEC!K12","v":15000},null,null,{"$f":"DEC!N12","v":15000},null,null,{"$f":"DEC!Q12","v":15000}]
[null,"Gradiente (%):",{"$f":"DEC!B13","v":0.02},null,null,{"$f":"DEC!E13","v":0.02},null,null,{"$f":"DEC!H13","v":0.04},null,null,{"$f":"DEC!K13","v":0.04},null,null,{"$f":"DEC!N13","v":0.04},null,null,{"$f":"DEC!Q13","v":0.04}]
[null,"Elevação da borda externa (m):",{"$f":"DEC!B14","v":1086.3789999999999},null,null,{"$f":"DEC!E14","v":1087.71},null,null,{"$f":"DEC!H14","v":600},null,null,{"$f":"DEC!K14","v":600},null,null,{"$f":"DEC!N14","v":600},null,null,{"$f":"DEC!Q14","v":600}]
[null,"Superfície de Aprox. Interna:","CAB 1",null,null,"CAB 2",null,null,"CAB 3",null,null,"CAB 4",null,null,"CAB 5",null,null,"CAB 6"]
[null,"Largura da borda interna (m):",{"$f":"'APROX INTERNA'!B6","v":"NA"},null,null,{"$f":"'APROX INTERNA'!E6","v":"NA"},null,null,{"$f":"'APROX INTERNA'!H6","v":90},null,null,{"$f":"'APROX INTERNA'!K6","v":90},null,null,{"$f":"'APROX INTERNA'!N6","v":90},null,null,{"$f":"'APROX INTERNA'!Q6","v":90}]
[null,"Elevação da borda interna (m):",{"$f":"'APROX INTERNA'!B7","v":"NA"},null,null,{"$f":"'APROX INTERNA'!E7","v":"NA"},null,null,{"$f":"'APROX INTERNA'!H7","v":0},null,null,{"$f":"'APROX INTERNA'!K7","v":0},null,null,{"$f":"'APROX INTERNA'!N7","v":0},null,null,{"$f":"'APROX INTERNA'!Q7","v":0}]
[null,"Distância da cabeceira (m):",{"$f":"'APROX INTERNA'!B8","v":"NA"},null,null,{"$f":"'APROX INTERNA'!E8","v":"NA"},null,null,{"$f":"'APROX INTERNA'!H8","v":60},null,null,{"$f":"'APROX INTERNA'!K8","v":60},null,null,{"$f":"'APROX INTERNA'!N8","v":60},null,null,{"$f":"'APROX INTERNA'!Q8","v":60}]
[null,"Abertura para cada lado (%):",{"$f":"'APROX INTERNA'!B9","v":"NA"},null,null,{"$f":"'APROX INTERNA'!E9","v":"NA"},null,null,{"$f":"'APROX INTERNA'!H9","v":"PARALELA"},null,null,{"$f":"'APROX INTERNA'!K9","v":"PARALELA"},null,null,{"$f":"'APROX INTERNA'!N9","v":"PARALELA"},null,null,{"$f":"'APROX INTERNA'!Q9","v":"PARALELA"}]
[null,"Comprimento (m):",{"$f":"'APROX INTERNA'!B10","v":"NA"},null,null,{"$f":"'APROX INTERNA'!E10","v":"NA"},null,null,{"$f":"'APROX INTERNA'!H10","v":900},null,null,{"$f":"'APROX INTERNA'!K10","v":900},null,null,{"$f":"'APROX INTERNA'!N10","v":900},null,null,{"$f":"'APROX INTERNA'!Q10","v":900}]
[null,"Gradiente (%):",{"$f":"'APROX INTERNA'!B11","v":"NA"},null,null,{"$f":"'APROX INTERNA'!E11","v":"NA"},null,null,{"$f":"'APROX INTERNA'!H11","v":2.5000000000000001E-2},null,null,{"$f":"'APROX INTERNA'!K11","v":2.5000000000000001E-2},null,null,{"$f":"'APROX INTERNA'!N11","v":2.5000000000000001E-2},null,null,{"$f":"'APROX INTERNA'!Q11","v":2.5000000000000001E-2}]
[null,"Elevação da borda externa (m):",{"$f":"'APROX INTERNA'!B12","v":"NA"},null,null,{"$f":"'APROX INTERNA'!E12","v":"NA"},null,null,{"$f":"'APROX INTERNA'!H12","v":22.5},null,null,{"$f":"'APROX INTERNA'!K12","v":22.5},null,null,{"$f":"'APROX INTERNA'!N12","v":22.5},null,null,{"$f":"'APROX INTERNA'!Q12","v":22.5}]
[null,"Superfície de Transição Interna:","CAB 1",null,null,"CAB 2",null,null,"CAB 3",null,null,"CAB 4",null,null,"CAB 5",null,null,"CAB 6"]
[null,"Gradiente (%):",{"$f":"'TRANSIÇÃO INTERNA'!B6","v":"NA"},null,null,{"$f":"'TRANSIÇÃO INTERNA'!E6","v":"NA"},null,null,{"$f":"'TRANSIÇÃO INTERNA'!H6","v":0.4},null,null,{"$f":"'TRANSIÇÃO INTERNA'!K6","v":0.4},null,null,{"$f":"'TRANSIÇÃO INTERNA'!N6","v":0.4},null,null,{"$f":"'TRANSIÇÃO INTERNA'!Q6","v":0.4}]
[null,"Elevação da borda superior (m):",{"$f":"'TRANSIÇÃO INTERNA'!B7","v":"NA"},null,null,{"$f":"'TRANSIÇÃO INTERNA'!E7","v":"NA"},null,null,{"$f":"'TRANSIÇÃO INTERNA'!H7","v":832.71},null,null,{"$f":"'TRANSIÇÃO INTERNA'!K7","v":832.71},null,null,{"$f":"'TRANSIÇÃO INTERNA'!N7","v":832.71},null,null,{"$f":"'TRANSIÇÃO INTERNA'!Q7","v":832.71}]
[null,"Superfície de Pouso Interrompido:","CAB 1",null,null,"CAB 2",null,null,"CAB 3",null,null,"CAB 4",null,null,"CAB 5",null,null,"CAB 6"]
[null,"Largura da borda interna (m):",{"$f":"'POUSO INTERROMPIDO'!B7","v":"NA"},null,null,{"$f":"'POUSO INTERROMPIDO'!E7","v":"NA"},null,null,{"$f":"'POUSO INTERROMPIDO'!H7","v":90},null,null,{"$f":"'POUSO INTERROMPIDO'!K7","v":90},null,null,{"$f":"'POUSO INTERROMPIDO'!N7","v":90},null,null,{"$f":"'POUSO INTERROMPIDO'!Q7","v":90}]
[null,"Elevação da borda interna (m):",{"$f":"'POUSO INTERROMPIDO'!B8","v":"NA"},null,null,{"$f":"'POUSO INTERROMPIDO'!E8","v":"NA"},null,null,{"$f":"'POUSO INTERROMPIDO'!H8","v":0},null,null,{"$f":"'POUSO INTERROMPIDO'!K8","v":0},null,null,{"$f":"'POUSO INTERROMPIDO'!N8","v":0},null,null,{"$f":"'POUSO INTERROMPIDO'!Q8","v":0}]
[null,"Distância da cabeceira (m):",{"$f":"'POUSO INTERROMPIDO'!B9","v":"NA"},null,null,{"$f":"'POUSO INTERROMPIDO'!E9","v":"NA"},null,null,{"$f":"'POUSO INTERROMPIDO'!H9","v":180.1},null,null,{"$f":"'POUSO INTERROMPIDO'!K9","v":180.1},null,null,{"$f":"'POUSO INTERROMPIDO'!N9","v":180.1},null,null,{"$f":"'POUSO INTERROMPIDO'!Q9","v":180.1}]
[null,"Abertura para cada lado (%):",{"$f":"'POUSO INTERROMPIDO'!B10","v":"NA"},null,null,{"$f":"'POUSO INTERROMPIDO'!E10","v":"NA"},null,null,{"$f":"'POUSO INTERROMPIDO'!H10","v":0.1},null,null,{"$f":"'POUSO INTERROMPIDO'!K10","v":0.1},null,null,{"$f":"'POUSO INTERROMPIDO'!N10","v":0.1},null,null,{"$f":"'POUSO INTERROMPIDO'!Q10","v":0.1}]
[null,"Gradiente (%):",{"$f":"'POUSO INTERROMPIDO'!B11","v":"NA"},null,null,{"$f":"'POUSO INTERROMPIDO'!E11","v":"NA"},null,null,{"$f":"'POUSO INTERROMPIDO'!H11","v":0.04},null,null,{"$f":"'POUSO INTERROMPIDO'!K11","v":0.04},null,null,{"$f":"'POUSO INTERROMPIDO'!N11","v":0.04},null,null,{"$f":"'POUSO INTERROMPIDO'!Q11","v":0.04}]
[null,"Elevação da borda externa (m):",{"$f":"'POUSO INTERROMPIDO'!B12","v":"NA"},null,null,{"$f":"'POUSO INTERROMPIDO'!E12","v":"NA"},null,null,{"$f":"'POUSO INTERROMPIDO'!H12","v":832.71},null,null,{"$f":"'POUSO INTERROMPIDO'!K12","v":832.71},null,null,{"$f":"'POUSO INTERROMPIDO'!N12","v":832.71},null,null,{"$f":"'POUSO INTERROMPIDO'!Q12","v":832.71}]
[null,"Superfície de Transição:","Pista 1",null,null,null,null,null,"Pista 2",null,null,null,null,null,"Pista 3"]
[null,"Gradiente (%):",{"$f":"TRANSIÇÃO!B5","v":0.14299999999999999},null,null,null,null,null,{"$f":"TRANSIÇÃO!C5","v":0.2},null,null,null,null,null,{"$f":"TRANSIÇÃO!D5","v":0.2}]
[null,"Superfície Horizontal Interna:","Pista 1",null,null,null,null,null,"Pista 2",null,null,null,null,null,"Pista 3"]
[null,"Altitude (m):",{"$f":"'HORIZONTAL INTERNA'!B4","v":832.71},null,null,null,null,null,{"$f":"'HORIZONTAL INTERNA'!C4","v":832.71},null,null,null,null,null,{"$f":"'HORIZONTAL INTERNA'!D4","v":832.71}]
[null,"Raio (m)",{"$f":"'HORIZONTAL INTERNA'!B5","v":4000},null,null,null,null,null,{"$f":"'HORIZONTAL INTERNA'!C5","v":3500},null,null,null,null,null,{"$f":"'HORIZONTAL INTERNA'!D5","v":3500}]
[null,"Superfície Cônica:","Pista 1",null,null,null,null,null,"Pista 2",null,null,null,null,null,"Pista 3"]
[null,"Altitude (m):",{"$f":"CÔNICA!B4","v":907.71},null,null,null,null,null,{"$f":"CÔNICA!C4","v":832.71},null,null,null,null,null,{"$f":"CÔNICA!D4","v":832.71}]
[null,"Gradiente (%):",{"$f":"CÔNICA!B5","v":0.05},null,null,null,null,null,{"$f":"CÔNICA!C5","v":0.05},null,null,null,null,null,{"$f":"CÔNICA!D5","v":0.05}]
[null,"Superfície de Prot voo IFR:","Pista 1",null,null,null,null,null,"Pista 2",null,null,null,null,null,"Pista 3"]
[null,"Raio (m):",{"$f":"IF(AND(C27=\"VFR\",C30=\"VFR\",F27=\"VFR\",F30=\"VFR\"),\"NA\",20000)","v":"NA"},null,null,null,null,null,{"$f":"IF(AND(I27=\"VFR\",I30=\"VFR\",L27=\"VFR\",L30=\"VFR\"),\"NA\",20000)","v":20000},null,null,null,null,null,{"$f":"IF(AND(O27=\"VFR\",O30=\"VFR\",R27=\"VFR\",R30=\"VFR\"),\"NA\",20000)","v":20000}]
[null,"Altitude (m):",{"$f":"IF(C110=\"NA\",\"NA\",$C$7+150)","v":"NA"},null,null,null,null,null,{"$f":"IF(I110=\"NA\",\"NA\",$C$7+150)","v":937.71},null,null,null,null,null,{"$f":"IF(O110=\"NA\",\"NA\",$C$7+150)","v":937.71}]
[null,"Superfície de Prot Voo Visual:","Pista 1",null,null,null,null,null,"Pista 2",null,null,null,null,null,"Pista 3"]
[null,"Área 1:","Aplicável"]
[null,"Largura (m):",{"$f":"SPVV!B1","v":2350},null,null,null,null,null,{"$f":"SPVV!H1","v":"NA"},null,null,null,null,null,{"$f":"SPVV!N1","v":"NA"}]
[null,"Buffer (m):",{"$f":"SPVV!B2","v":470},null,null,null,null,null,{"$f":"SPVV!H2","v":"NA"},null,null,null,null,null,{"$f":"SPVV!N2","v":"NA"}]
[null,"Comprimento (m):",{"$f":"SPVV!B3","v":2350},null,null,null,null,null,{"$f":"SPVV!H3","v":"NA"},null,null,null,null,null,{"$f":"SPVV!N3","v":"NA"}]
[null,null,"CAB 1",null,null,"CAB 2",null,null,"CAB 3",null,null,"CAB 4",null,null,"CAB 5",null,null,"CAB 6"]
[null,"Altitude seção de través (m):",{"$f":"SPVV!B5","v":863.50907339673256},null,null,{"$f":"SPVV!E5","v":863.50907339673256},null,null,{"$f":"SPVV!H5","v":"NA"},null,null,{"$f":"SPVV!K5","v":"NA"},null,null,{"$f":"SPVV!N5","v":"NA"},null,null,{"$f":"SPVV!Q5","v":"NA"}]
[null,"Altitude seção de aprox/dep (m):",{"$f":"SPVV!B6","v":840.64879541575226},null,null,{"$f":"SPVV!E6","v":840.64879541575226},null,null,{"$f":"SPVV!H6","v":"NA"},null,null,{"$f":"SPVV!K6","v":"NA"},null,null,{"$f":"SPVV!N6","v":"NA"},null,null,{"$f":"SPVV!Q6","v":"NA"}]
[null,null,"CAB 1",null,null,"CAB 2",null,null,"CAB 3",null,null,"CAB 4",null,null,"CAB 5",null,null,"CAB 6"]
[null,"Curvas permitidas no circuito de tráfego:","Ambas",null,null,"Ambas"]
[null,"Altura mínima do circuito de tráfego:",152,null,null,152]
[null,null,"Pista 1",null,null,null,null,null,"Pista 2",null,null,null,null,null,"Pista 3"]
[null,"Área 2:","Aplicável"]
[null,"Categoria de performance crítica:","C"]
[null,"Largura (m):",{"$f":"SPVV!B10","v":4170},null,null,null,null,null,{"$f":"SPVV!H10","v":"NA"},null,null,null,null,null,{"$f":"SPVV!N10","v":"NA"}]
[null,"Buffer (m):",{"$f":"SPVV!B11","v":930},null,null,null,null,null,{"$f":"SPVV!H11","v":"NA"},null,null,null,null,null,{"$f":"SPVV!N11","v":"NA"}]
[null,"Comprimento (m):",{"$f":"SPVV!B12","v":4170},null,null,null,null,null,{"$f":"SPVV!H12","v":"NA"},null,null,null,null,null,{"$f":"SPVV!N12","v":"NA"}]
[null,null,"CAB 1",null,null,"CAB 2",null,null,"CAB 3",null,null,"CAB 4",null,null,"CAB 5",null,null,"CAB 6"]
[null,"Altitude seção través (m):",{"$f":"SPVV!B14","v":940.30814679346508},null,null,{"$f":"SPVV!E14","v":940.30814679346508},null,null,{"$f":"SPVV!H14","v":"NA"},null,null,{"$f":"SPVV!K14","v":"NA"},null,null,{"$f":"SPVV!N14","v":"NA"},null,null,{"$f":"SPVV!Q14","v":"NA"}]
[null,"Altitude seção aprox/dep (m):",{"$f":"SPVV!B15","v":894.5875908315046},null,null,{"$f":"SPVV!E15","v":894.5875908315046},null,null,{"$f":"SPVV!H15","v":"NA"},null,null,{"$f":"SPVV!K15","v":"NA"},null,null,{"$f":"SPVV!N15","v":"NA"},null,null,{"$f":"SPVV!Q15","v":"NA"}]
[null,null,"CAB 1",null,null,"CAB 2",null,null,"CAB 3",null,null,"CAB 4",null,null,"CAB 5",null,null,"CAB 6"]
[null,"Curvas permitidas no circuito de tráfego:","Ambas",null,null,"Ambas"]
[null,"Altura mínima do circ. de tráfego:",305,null,null,305]
[null,null,"Pista 1",null,null,null,null,null,"Pista 2",null,null,null,null,null,"Pista 3"]
[null,"Área 3:","NA"]
[null,"Largura (m):",{"$f":"SPVV!B16","v":"NA"},null,null,null,null,null,{"$f":"SPVV!H16","v":"NA"},null,null,null,null,null,{"$f":"SPVV!N16","v":"NA"}]
[null,"Buffer (m):",{"$f":"SPVV!B17","v":"NA"},null,null,null,null,null,{"$f":"SPVV!H17","v":"NA"},null,null,null,null,null,{"$f":"SPVV!N17","v":"NA"}]
[null,"Comprimento (m):",{"$f":"SPVV!B18","v":"NA"},null,null,null,null,null,{"$f":"SPVV!H18","v":"NA"},null,null,null,null,null,{"$f":"SPVV!N18","v":"NA"}]
[null,"Altitude seção través (m):",{"$f":"SPVV!B19","v":"NA"},null,null,null,null,null,{"$f":"SPVV!H19","v":"NA"},null,null,null,null,null,{"$f":"SPVV!N19","v":"NA"}]
[null,"Altitude seção aprox/dep (m):",{"$f":"SPVV!B20","v":"NA"},null,null,null,null,null,{"$f":"SPVV!H20","v":"NA"},null,null,null,null,null,{"$f":"SPVV!N20","v":"NA"}]
[null,null,"CAB 1",null,null,"CAB 2",null,null,"CAB 3",null,null,"CAB 4",null,null,"CAB 5",null,null,"CAB 6"]
[null,"Curvas permitidas no circuito de tráfego:"]

{"sheet":"DADOS GERAIS-A","index":2,"n_rows":12,"n_cols":4,"rows_kept":12,"cut":false,"hidden":true,"merged":[]}
["A"," Dados Gerais do Aeródromo:"]
["A1","Denominação do Aeródromo:","Comandante Antônio Amilton Beraldo"]
["A2","Código OACI:","SSZW"]
["A3","ARP (Latitude):",25,"GRAUS"]
[null,null,11,"MIN"]
[null,null,4,"SEC"]
[null,null,"s"]
["A4","ARP (Longitude):",50,"GRAUS"]
[null,null,8,"MIN"]
[null,null,38,"SEC"]
[null,null,"w"]
["A5","Elevação (m):"]

{"sheet":"calculo","index":3,"n_rows":34,"n_cols":14,"rows_kept":34,"cut":false,"hidden":true,"merged":[[3,4,3,6],[15,4,15,6],[27,4,27,6],[3,11,3,13]]}
[null,"Comprimento","Rumo Verd",null,null,null,null,null,"Comprimento","Rumo Verd"]
[null,{"$f":"IF((B5^2+C5^2)^0.5=0,0.1,(B5^2+C5^2)^0.5)","v":1280.4231856208191},{"$f":"IF(B6>B7,IF(C6>C7,360-(90+D6),90+D6),IF(C6>C7,270+D6,90-D6))","v":58.902927954098132},null,null,null,null,null,{"$f":"IF((I5^2+J5^2)^0.5=0,0.1,(I5^2+J5^2)^0.5)","v":1280.4231856208191},{"$f":"IF(I6>I7,IF(J6>J7,360-(90+K6),90+K6),IF(J6>J7,270+K6,90-K6))","v":238.90292795409812}]
[]
[null,"y (dist. latitude)","x (dist. Long.)","a","Coordenadas ",null,null,null,"y (dist. latitude)","x (dist. Long.)","a","Coordenadas "]
[null,{"$f":"IF(OR(SIGN(E6*3600+F6*60+G6)*SIGN(E7*3600+F7*60+G7)>0,SIGN(E6*3600+F6*60+G6)*SIGN(E7*3600+F7*60+G7)=0),(ABS((B6-B7)*1852/60)*B8),((ABS(B6)+ABS(B7))*1852/60)*B8)","v":661.32522165465446},{"$f":"ABS((C6-C7)*1852/60)*C8","v":1096.4180249698511},{"$f":"IF(B6>B7,(B6-ABS(B6-B7)/2)/3600,(B7-ABS(B6-B7)/2)/3600)","v":25.184072222222223},{"$f":"FORMULÁRIO!$F$23","v":50},{"$f":"FORMULÁRIO!$G$23","v":8},{"$f":"FORMULÁRIO!$H$23","v":15.87},null,{"$f":"IF(OR(SIGN(L6*3600+M6*60+N6)*SIGN(L7*3600+M7*60+N7)>0,SIGN(L6*3600+M6*60+N6)*SIGN(L7*3600+M7*60+N7)=0),(ABS((I6-I7)*1852/60)*I8),((ABS(I6)+ABS(I7))*1852/60)*I8)","v":661.32522165465446},{"$f":"ABS((J6-J7)*1852/60)*J8","v":1096.4180249698511},{"$f":"IF(I6>I7,(I6-ABS(I6-I7)/2)/3600,(I7-ABS(I6-I7)/2)/3600)","v":25.184072222222223},{"$f":"E8","v":50},{"$f":"F8","v":8},55.02]
[null,{"$f":"E6*60^2+F6*60+G6","v":90651.91},{"$f":"E5*60^2+F5*60+G5","v":180495.87},{"$f":"ACOS(C5/B2)*180/PI()","v":31.097072045901868},{"$f":"FORMULÁRIO!$F$22","v":25},{"$f":"FORMULÁRIO!$G$22","v":10},{"$f":"FORMULÁRIO!$H$22","v":51.91},null,{"$f":"L6*60^2+M6*60+N6","v":90673.41},{"$f":"L5*60^2+M5*60+N5","v":180535.02},{"$f":"ACOS(J5/I2)*180/PI()","v":31.097072045901868},{"$f":"E7","v":25},{"$f":"F7","v":11},13.41]
[null,{"$f":"E7*60^2+F7*60+G7","v":90673.41},{"$f":"E8*60^2+F8*60+G8","v":180535.02},null,{"$f":"FORMULÁRIO!$C$22","v":25},{"$f":"FORMULÁRIO!$D$22","v":11},{"$f":"FORMULÁRIO!$E$22","v":13.41},null,{"$f":"L7*60^2+M7*60+N7","v":90651.91},{"$f":"L8*60^2+M8*60+N8","v":180495.87},null,{"$f":"E6","v":25},{"$f":"F6","v":10},51.91]
[null,{"$f":"IF(D5<2,COS((5.676*PI())/180),IF(D5<4,COS((5.66*PI())/180),IF(D5<6,COS((5.634*PI())/180),IF(D5<8,COS((5.59*PI())/180),IF(D5<10,COS((5.54*PI())/180),B9)))))","v":0.99652200761663745},{"$f":"IF(D5<2,1.00147,IF(D5<4,1.00012,IF(D5<6,COS(((D5-1.25)*PI())/180),IF(D5<10,COS(((D5-0.8)*PI())/180),IF(D5<19,COS(((D5-0.4)*PI())/180),COS(((D5-0.32)*PI())/180))))))","v":0.90730784982995616},null,{"$f":"FORMULÁRIO!$C$23","v":50},{"$f":"FORMULÁRIO!$D$23","v":8},{"$f":"FORMULÁRIO!$E$23","v":55.02},null,{"$f":"IF(K5<2,COS((5.676*PI())/180),IF(K5<4,COS((5.66*PI())/180),IF(K5<6,COS((5.634*PI())/180),IF(K5<8,COS((5.59*PI())/180),IF(K5<10,COS((5.54*PI())/180),I9)))))","v":0.99652200761663745},{"$f":"IF(K5<2,1.00147,IF(K5<4,1.00012,IF(K5<6,COS(((K5-1.25)*PI())/180),IF(K5<10,COS(((K5-0.8)*PI())/180),IF(K5<19,COS(((K5-0.4)*PI())/180),COS(((K5-0.32)*PI())/180))))))","v":0.90730784982995616},null,{"$f":"E5","v":50},{"$f":"F5","v":8},15.87]
[null,{"$f":"IF(D5<13,COS((5.4*PI())/180),IF(D5<16,COS((5.3*PI())/180),IF(D5<19,COS((5.2*PI())/180),IF(D5<22,COS((4.82*PI())/180),B10))))","v":0.99652200761663745},null,{"$f":"IF(B6>B7,IF(C6>C7,360-(90+D6),90+D6),IF(C6>C7,360-(90-D6),90-D6))","v":58.902927954098132},null,null,null,null,{"$f":"IF(K5<13,COS((5.4*PI())/180),IF(K5<16,COS((5.3*PI())/180),IF(K5<19,COS((5.2*PI())/180),IF(K5<22,COS((4.82*PI())/180),I10))))","v":0.99652200761663745},null,{"$f":"IF(I6>I7,IF(J6>J7,360-(90+K6),90+K6),IF(J6>J7,360-(90-K6),90-K6))","v":238.90292795409812}]
[null,{"$f":"IF(D5<26,COS((4.78*PI())/180),IF(D5<28,COS((4.45*PI())/180),IF(D5<30,COS((4.2*PI())/180),COS((3.9*PI())/180))))","v":0.99652200761663745},null,null,null,null,null,null,{"$f":"IF(K5<26,COS((4.78*PI())/180),IF(K5<28,COS((4.45*PI())/180),IF(K5<30,COS((4.2*PI())/180),COS((3.9*PI())/180))))","v":0.99652200761663745}]
[]
[]
[null,"Comprimento","Rumo Verd"]
[null,{"$f":"IF((B17^2+C17^2)^0.5=0,0.1,(B17^2+C17^2)^0.5)","v":0.1},{"$f":"IF(B18>B19,IF(C18>C19,360-(90+D18),90+D18),IF(C18>C19,270+D18,90-D18))","v":0}]
[]
[null,"y (dist. latitude)","x (dist. Long.)","a","Coordenadas "]
[null,{"$f":"IF(OR(SIGN(E18*3600+F18*60+G18)*SIGN(E19*3600+F19*60+G19)>0,SIGN(E18*3600+F18*60+G18)*SIGN(E19*3600+F19*60+G19)=0),(ABS((B18-B19)*1852/60)*B20),((ABS(B18)+ABS(B19))*1852/60)*B20)","v":0},{"$f":"ABS((C18-C19)*1852/60)*C20","v":0},{"$f":"IF(B18>B19,(B18-ABS(B18-B19)/2)/3600,(B19-ABS(B18-B19)/2)/3600)","v":0},{"$f":"FORMULÁRIO!$L$23","v":0},{"$f":"FORMULÁRIO!$M$23","v":0},{"$f":"FORMULÁRIO!$N$23","v":0},{"$f":"E17+F17/60+G17/3600","v":0},{"$f":"B14","v":0.1}]
[null,{"$f":"E18*60^2+F18*60+G18","v":0},{"$f":"E17*60^2+F17*60+G17","v":0},{"$f":"ACOS(C17/B14)*180/PI()","v":90},{"$f":"FORMULÁRIO!$L$22","v":0},{"$f":"FORMULÁRIO!$M$22","v":0},{"$f":"FORMULÁRIO!$N$22","v":0},{"$f":"E18+F18/60+G18/3600","v":0},6353000]
[null,{"$f":"E19*60^2+F19*60+G19","v":0},{"$f":"E20*60^2+F20*60+G20","v":0},null,{"$f":"FORMULÁRIO!$I$22","v":0},{"$f":"FORMULÁRIO!$J$22","v":0},{"$f":"FORMULÁRIO!$K$22","v":0},{"$f":"E19+F19/60+G19/3600","v":0}]
[null,{"$f":"IF(D17<2,COS((5.676*PI())/180),IF(D17<4,COS((5.66*PI())/180),IF(D17<6,COS((5.634*PI())/180),IF(D17<8,COS((5.59*PI())/180),IF(D17<10,COS((5.54*PI())/180),B21)))))","v":0.99509708562345478},{"$f":"IF(D17<2,1.00147,IF(D17<4,1.00012,IF(D17<6,COS(((D17-1.25)*PI())/180),IF(D17<10,COS(((D17-0.8)*PI())/180),IF(D17<19,COS(((D17-0.4)*PI())/180),COS(((D17-0.32)*PI())/180))))))","v":1.0014700000000001},null,{"$f":"FORMULÁRIO!$I$23","v":0},{"$f":"FORMULÁRIO!$J$23","v":0},{"$f":"FORMULÁRIO!$K$23","v":0},{"$f":"E20+F20/60+G20/3600","v":0}]
[null,{"$f":"IF(D17<13,COS((5.4*PI())/180),IF(D17<16,COS((5.3*PI())/180),IF(D17<19,COS((5.2*PI())/180),IF(D17<22,COS((4.82*PI())/180),B22))))","v":0.99556196460308},null,{"$f":"IF(B18>B19,IF(C18>C19,360-(90+D18),90+D18),IF(C18>C19,360-(90-D18),90-D18))","v":0}]
[null,{"$f":"IF(D17<26,COS((4.78*PI())/180),IF(D17<28,COS((4.45*PI())/180),IF(D17<30,COS((4.2*PI())/180),COS((3.9*PI())/180))))","v":0.99652200761663745}]
[]
[]
[null,"Comprimento","Rumo Verd"]
[null,{"$f":"IF((B29^2+C29^2)^0.5=0,0.1,(B29^2+C29^2)^0.5)","v":0.1},{"$f":"IF(B30>B31,IF(C30>C31,360-(90+D30),90+D30),IF(C30>C31,270+D30,90-D30))","v":0}]
[]
[null,"y (dist. latitude)","x (dist. Long.)","a","Coordenadas "]
[null,{"$f":"IF(OR(SIGN(E30*3600+F30*60+G30)*SIGN(E31*3600+F31*60+G31)>0,SIGN(E30*3600+F30*60+G30)*SIGN(E31*3600+F31*60+G31)=0),(ABS((B30-B31)*1852/60)*B32),((ABS(B30)+ABS(B31))*1852/60)*B32)","v":0},{"$f":"ABS((C30-C31)*1852/60)*C32","v":0},{"$f":"IF(B30>B31,(B30-ABS(B30-B31)/2)/3600,(B31-ABS(B30-B31)/2)/3600)","v":0},{"$f":"FORMULÁRIO!$R$23","v":0},{"$f":"FORMULÁRIO!$S$23","v":0},{"$f":"FORMULÁRIO!$T$23","v":0},{"$f":"E29+F29/60+G29/3600","v":0},{"$f":"B26","v":0.1}]
[null,{"$f":"E30*60^2+F30*60+G30","v":0},{"$f":"E29*60^2+F29*60+G29","v":0},{"$f":"ACOS(C29/B26)*180/PI()","v":90},{"$f":"FORMULÁRIO!$R$22","v":0},{"$f":"FORMULÁRIO!$S$22","v":0},{"$f":"FORMULÁRIO!$T$22","v":0},{"$f":"E30+F30/60+G30/3600","v":0},6353000]
[null,{"$f":"E31*60^2+F31*60+G31","v":0},{"$f":"E32*60^2+F32*60+G32","v":0},null,{"$f":"FORMULÁRIO!$O$22","v":0},{"$f":"FORMULÁRIO!$P$22","v":0},{"$f":"FORMULÁRIO!$Q$22","v":0},{"$f":"E31+F31/60+G31/3600","v":0}]
[null,{"$f":"IF(D29<2,COS((5.676*PI())/180),IF(D29<4,COS((5.66*PI())/180),IF(D29<6,COS((5.634*PI())/180),IF(D29<8,COS((5.59*PI())/180),IF(D29<10,COS((5.54*PI())/180),B33)))))","v":0.99509708562345478},{"$f":"IF(D29<2,1.00147,IF(D29<4,1.00012,IF(D29<6,COS(((D29-1.25)*PI())/180),IF(D29<10,COS(((D29-0.8)*PI())/180),IF(D29<19,COS(((D29-0.4)*PI())/180),COS(((D29-0.32)*PI())/180))))))","v":1.0014700000000001},null,{"$f":"FORMULÁRIO!$O$23","v":0},{"$f":"FORMULÁRIO!$P$23","v":0},{"$f":"FORMULÁRIO!$Q$23","v":0},{"$f":"E32+F32/60+G32/3600","v":0}]
[null,{"$f":"IF(D29<13,COS((5.4*PI())/180),IF(D29<16,COS((5.3*PI())/180),IF(D29<19,COS((5.2*PI())/180),IF(D29<22,COS((4.82*PI())/180),B34))))","v":0.99556196460308},null,{"$f":"IF(B30>B31,IF(C30>C31,360-(90+D30),90+D30),IF(C30>C31,360-(90-D30),90-D30))","v":0}]
[null,{"$f":"IF(D29<26,COS((4.78*PI())/180),IF(D29<28,COS((4.45*PI())/180),IF(D29<30,COS((4.2*PI())/180),COS((3.9*PI())/180))))","v":0.99652200761663745}]

{"sheet":"PISTA","index":4,"n_rows":16,"n_cols":4,"rows_kept":16,"cut":false,"hidden":true,"merged":[]}
["CODIGO DE REFERÊNCIA",{"$f":"FORMULÁRIO!C12","v":3},{"$f":"FORMULÁRIO!I12","v":0},{"$f":"FORMULÁRIO!O12","v":0}]
["TIPO DE OPERAÇÃO (VFR, IFR OU IFR-P)",{"$f":"IF(B16<10,\"VFR\",IF(B16<100,\"IFR\",\"IFR-P\"))","v":"VFR"},{"$f":"IF(C16<10,\"VFR\",IF(C16<100,\"IFR\",\"IFR-P\"))","v":"IFR-P"},{"$f":"IF(D16<10,\"VFR\",IF(D16<100,\"IFR\",\"IFR-P\"))","v":"IFR-P"}]
[]
[]
[]
["COMPRIMENTO DA PISTA",{"$f":"FORMULÁRIO!C13","v":1280.4231856208191},{"$f":"FORMULÁRIO!I13","v":0.1},{"$f":"FORMULÁRIO!O13","v":0.1}]
["LARGURA DA PISTA",{"$f":"FORMULÁRIO!C14","v":30},{"$f":"FORMULÁRIO!I14","v":0},{"$f":"FORMULÁRIO!O14","v":0}]
["FAIXA DE PISTA LARGURA",{"$f":"IF(B2=\"VFR\",IF(B1=1,60,IF(B1=2,80,150)),IF(B1<3,150,300))","v":150},{"$f":"IF(C2=\"VFR\",IF(C1=1,60,IF(C1=2,80,150)),IF(C1<3,150,300))","v":150},{"$f":"IF(D2=\"VFR\",IF(D1=1,60,IF(D1=2,80,150)),IF(D1<3,150,300))","v":150}]
["FAIXA DE PISTA COMPRIMENTO",{"$f":"IF(AND(B1=1,B2=\"vfr\"),30,60)*2+B6+FORMULÁRIO!C40+FORMULÁRIO!F40","v":1400.4231856208191},{"$f":"IF(AND(C1=1,C2=\"vfr\"),30,60)*2+C6+FORMULÁRIO!I40+FORMULÁRIO!L40","v":120.1},{"$f":"IF(AND(D1=1,D2=\"vfr\"),30,60)*2+D6+FORMULÁRIO!O40+FORMULÁRIO!R40","v":120.1}]
[]
[]
[null,{"$f":"IF(FORMULÁRIO!C27=\"vfr\",1,IF(FORMULÁRIO!C27=\"ifr npa\",10,IF(FORMULÁRIO!C27=\"não aplicável\",0,1000)))","v":1},{"$f":"IF(FORMULÁRIO!I27=\"vfr\",1,IF(FORMULÁRIO!I27=\"ifr npa\",10,IF(FORMULÁRIO!I27=\"não aplicável\",0,1000)))","v":1000},{"$f":"IF(FORMULÁRIO!O27=\"vfr\",1,IF(FORMULÁRIO!O27=\"ifr npa\",10,IF(FORMULÁRIO!O27=\"não aplicável\",0,1000)))","v":1000}]
[null,{"$f":"IF(FORMULÁRIO!C30=\"vfr\",1,IF(FORMULÁRIO!C30=\"ifr npa\",10,IF(FORMULÁRIO!C30=\"não aplicável\",0,1000)))","v":1},{"$f":"IF(FORMULÁRIO!I30=\"vfr\",1,IF(FORMULÁRIO!I30=\"ifr npa\",10,IF(FORMULÁRIO!I30=\"não aplicável\",0,1000)))","v":1000},{"$f":"IF(FORMULÁRIO!O30=\"vfr\",1,IF(FORMULÁRIO!O30=\"ifr npa\",10,IF(FORMULÁRIO!O30=\"não aplicável\",0,1000)))","v":1000}]
[null,{"$f":"IF(FORMULÁRIO!F27=\"vfr\",1,IF(FORMULÁRIO!F27=\"ifr npa\",10,IF(FORMULÁRIO!F27=\"não aplicável\",0,1000)))","v":1},{"$f":"IF(FORMULÁRIO!L27=\"vfr\",1,IF(FORMULÁRIO!L27=\"ifr npa\",10,IF(FORMULÁRIO!L27=\"não aplicável\",0,1000)))","v":1000},{"$f":"IF(FORMULÁRIO!R27=\"vfr\",1,IF(FORMULÁRIO!R27=\"ifr npa\",10,IF(FORMULÁRIO!R27=\"não aplicável\",0,1000)))","v":1000}]
[null,{"$f":"IF(FORMULÁRIO!F30=\"vfr\",1,IF(FORMULÁRIO!F30=\"ifr npa\",10,IF(FORMULÁRIO!F30=\"não aplicável\",0,1000)))","v":1},{"$f":"IF(FORMULÁRIO!L30=\"vfr\",1,IF(FORMULÁRIO!L30=\"ifr npa\",10,IF(FORMULÁRIO!L30=\"não aplicável\",0,1000)))","v":1000},{"$f":"IF(FORMULÁRIO!R30=\"vfr\",1,IF(FORMULÁRIO!R30=\"ifr npa\",10,IF(FORMULÁRIO!R30=\"não aplicável\",0,1000)))","v":1000}]
[null,{"$f":"SUM(B12:B15)","v":4},{"$f":"SUM(C12:C15)","v":4000},{"$f":"SUM(D12:D15)","v":4000}]

{"sheet":"DEC","index":5,"n_rows":14,"n_cols":17,"rows_kept":14,"cut":false,"hidden":true,"merged":[]}
["CABECEIRA",{"$f":"FORMULÁRIO!C20","v":4.0082927954098135},null,null,{"$f":"FORMULÁRIO!F20","v":22.008292795409815},null,null,{"$f":"FORMULÁRIO!I20","v":-1.8820000000000001},null,null,{"$f":"FORMULÁRIO!L20","v":16.117999999999999},null,null,{"$f":"FORMULÁRIO!O20","v":-1.8820000000000001},null,null,{"$f":"FORMULÁRIO!R20","v":16.117999999999999}]
["ELEVAÇÃO CONSIDERADA",{"$f":"IF(B3>0,B3,APROX!E2)","v":786.37900000000002},null,null,{"$f":"IF(E3>0,E3,APROX!B2)","v":787.71},null,null,{"$f":"IF(H3>0,H3,APROX!K2)","v":0},null,null,{"$f":"IF(K3>0,K3,APROX!H2)","v":0},null,null,{"$f":"IF(N3>0,N3,APROX!K2)","v":0},null,null,{"$f":"IF(Q3>0,Q3,APROX!N2)","v":0}]
["MAIOR ELEVAÇÃO DA CLEARWAY OU FAIXA DE PISTA",{"$f":"FORMULÁRIO!C45","v":0},null,null,{"$f":"FORMULÁRIO!F45","v":0},null,null,{"$f":"FORMULÁRIO!I45","v":0},null,null,{"$f":"FORMULÁRIO!L45","v":0},null,null,{"$f":"FORMULÁRIO!O45","v":0},null,null,{"$f":"FORMULÁRIO!R45","v":0}]
["CODIGO REFERENCIA DECOLAGEM",{"$f":"FORMULÁRIO!C29","v":3},null,null,{"$f":"FORMULÁRIO!F29","v":3},null,null,{"$f":"FORMULÁRIO!I29","v":0},null,null,{"$f":"FORMULÁRIO!L29","v":0},null,null,{"$f":"FORMULÁRIO!O29","v":0},null,null,{"$f":"FORMULÁRIO!R29","v":0}]
["TIPO DE OPERAÇÃO (VFR OU IFR)",{"$f":"FORMULÁRIO!C30","v":"VFR"},null,null,{"$f":"FORMULÁRIO!F30","v":"VFR"},null,null,{"$f":"FORMULÁRIO!I30","v":0},null,null,{"$f":"FORMULÁRIO!L30","v":0},null,null,{"$f":"FORMULÁRIO!O30","v":0},null,null,{"$f":"FORMULÁRIO!R30","v":0}]
["SID EM CURVA? S ou N",{"$f":"FORMULÁRIO!C31","v":"NÃO"},null,null,{"$f":"FORMULÁRIO!F31","v":"NÃO"},null,null,{"$f":"FORMULÁRIO!I31","v":0},null,null,{"$f":"FORMULÁRIO!L31","v":0},null,null,{"$f":"FORMULÁRIO!O31","v":0},null,null,{"$f":"FORMULÁRIO!R31","v":0}]
["Largura da borda interna (m):",{"$f":"IF(OR(B5=\"NÃO aplicável\",B4=\"não aplicável\"),\"NA\",IF(B4=1,60,IF(B4=2,80,180)))","v":180},null,null,{"$f":"IF(OR(E5=\"NÃO aplicável\",E4=\"não aplicável\"),\"NA\",IF(E4=1,60,IF(E4=2,80,180)))","v":180},null,null,{"$f":"IF(OR(H5=\"NÃO aplicável\",H4=\"não aplicável\"),\"NA\",IF(H4=1,60,IF(H4=2,80,180)))","v":180},null,null,{"$f":"IF(OR(K5=\"NÃO aplicável\",K4=\"não aplicável\"),\"NA\",IF(K4=1,60,IF(K4=2,80,180)))","v":180},null,null,{"$f":"IF(OR(N5=\"NÃO aplicável\",N4=\"não aplicável\"),\"NA\",IF(N4=1,60,IF(N4=2,80,180)))","v":180},null,null,{"$f":"IF(OR(Q5=\"NÃO aplicável\",Q4=\"não aplicável\"),\"NA\",IF(Q4=1,60,IF(Q4=2,80,180)))","v":180}]
["Elevação da borda interna (m):",{"$f":"IF(OR(B5=\"NÃO aplicável\",B4=\"não aplicável\"),\"NA\",B2)","v":786.37900000000002},null,null,{"$f":"IF(OR(E5=\"NÃO aplicável\",E4=\"não aplicável\"),\"NA\",E2)","v":787.71},null,null,{"$f":"IF(OR(H5=\"NÃO aplicável\",H4=\"não aplicável\"),\"NA\",H2)","v":0},null,null,{"$f":"IF(OR(K5=\"NÃO aplicável\",K4=\"não aplicável\"),\"NA\",K2)","v":0},null,null,{"$f":"IF(OR(N5=\"NÃO aplicável\",N4=\"não aplicável\"),\"NA\",N2)","v":0},null,null,{"$f":"IF(OR(Q5=\"NÃO aplicável\",Q4=\"não aplicável\"),\"NA\",Q2)","v":0}]
["Distância do final da pista (m):",{"$f":"IF(OR(B5=\"NÃO aplicável\",B4=\"não aplicável\"),\"NA\",IF(FORMULÁRIO!C43>0,FORMULÁRIO!C43,IF(B5=\"vfr\",IF(B4=1,30,60),60)))","v":60},null,null,{"$f":"IF(OR(E5=\"NÃO aplicável\",E4=\"não aplicável\"),\"NA\",IF(FORMULÁRIO!F43>0,FORMULÁRIO!F43,IF(E5=\"vfr\",IF(E4=1,30,60),60)))","v":60},null,null,{"$f":"IF(OR(H5=\"NÃO aplicável\",H4=\"não aplicável\"),\"NA\",IF(FORMULÁRIO!I43>0,FORMULÁRIO!I43,IF(H5=\"vfr\",IF(H4=1,30,60),60)))","v":60},null,null,{"$f":"IF(OR(K5=\"NÃO aplicável\",K4=\"não aplicável\"),\"NA\",IF(FORMULÁRIO!L43>0,FORMULÁRIO!L43,IF(K5=\"vfr\",IF(K4=1,30,60),60)))","v":60},null,null,{"$f":"IF(OR(N5=\"NÃO aplicável\",N4=\"não aplicável\"),\"NA\",IF(FORMULÁRIO!O43>0,FORMULÁRIO!O43,IF(N5=\"vfr\",IF(N4=1,30,60),60)))","v":60},null,null,{"$f":"IF(OR(Q5=\"NÃO aplicável\",Q4=\"não aplicável\"),\"NA\",IF(FORMULÁRIO!R43>0,FORMULÁRIO!R43,IF(Q5=\"vfr\",IF(Q4=1,30,60),60)))","v":60}]
["Abertura para cada lado (%):",{"$f":"IF(OR(B5=\"NÃO aplicável\",B4=\"não aplicável\"),\"NA\",IF(B4>2,0.125,0.1))","v":0.125},null,null,{"$f":"IF(OR(E5=\"NÃO aplicável\",E4=\"não aplicável\"),\"NA\",IF(E4>2,0.125,0.1))","v":0.125},null,null,{"$f":"IF(OR(H5=\"NÃO aplicável\",H4=\"não aplicável\"),\"NA\",IF(H4>2,0.125,0.1))","v":0.1},null,null,{"$f":"IF(OR(K5=\"NÃO aplicável\",K4=\"não aplicável\"),\"NA\",IF(K4>2,0.125,0.1))","v":0.1},null,null,{"$f":"IF(OR(N5=\"NÃO aplicável\",N4=\"não aplicável\"),\"NA\",IF(N4>2,0.125,0.1))","v":0.1},null,null,{"$f":"IF(OR(Q5=\"NÃO aplicável\",Q4=\"não aplicável\"),\"NA\",IF(Q4>2,0.125,0.1))","v":0.1}]
["Largura final (m):",{"$f":"IF(OR(B5=\"NÃO aplicável\",B4=\"não aplicável\"),\"NA\",IF(B4=1,380,IF(B4=2,580,IF(B6=\"Sim\",1800,1200))))","v":1200},null,null,{"$f":"IF(OR(E5=\"NÃO aplicável\",E4=\"não aplicável\"),\"NA\",IF(E4=1,380,IF(E4=2,580,IF(E6=\"Sim\",1800,1200))))","v":1200},null,null,{"$f":"IF(OR(H5=\"NÃO aplicável\",H4=\"não aplicável\"),\"NA\",IF(H4=1,380,IF(H4=2,580,IF(H6=\"Sim\",1800,1200))))","v":1200},null,null,{"$f":"IF(OR(K5=\"NÃO aplicável\",K4=\"não aplicável\"),\"NA\",IF(K4=1,380,IF(K4=2,580,IF(K6=\"Sim\",1800,1200))))","v":1200},null,null,{"$f":"IF(OR(N5=\"NÃO aplicável\",N4=\"não aplicável\"),\"NA\",IF(N4=1,380,IF(N4=2,580,IF(N6=\"Sim\",1800,1200))))","v":1200},null,null,{"$f":"IF(OR(Q5=\"NÃO aplicável\",Q4=\"não aplicável\"),\"NA\",IF(Q4=1,380,IF(Q4=2,580,IF(Q6=\"Sim\",1800,1200))))","v":1200}]
["Comprimento (m):",{"$f":"IF(OR(B5=\"NÃO aplicável\",B4=\"não aplicável\"),\"NA\",IF(B4=1,1600,IF(B4=2,2500,15000)))","v":15000},null,null,{"$f":"IF(OR(E5=\"NÃO aplicável\",E4=\"não aplicável\"),\"NA\",IF(E4=1,1600,IF(E4=2,2500,15000)))","v":15000},null,null,{"$f":"IF(OR(H5=\"NÃO aplicável\",H4=\"não aplicável\"),\"NA\",IF(H4=1,1600,IF(H4=2,2500,15000)))","v":15000},null,null,{"$f":"IF(OR(K5=\"NÃO aplicável\",K4=\"não aplicável\"),\"NA\",IF(K4=1,1600,IF(K4=2,2500,15000)))","v":15000},null,null,{"$f":"IF(OR(N5=\"NÃO aplicável\",N4=\"não aplicável\"),\"NA\",IF(N4=1,1600,IF(N4=2,2500,15000)))","v":15000},null,null,{"$f":"IF(OR(Q5=\"NÃO aplicável\",Q4=\"não aplicável\"),\"NA\",IF(Q4=1,1600,IF(Q4=2,2500,15000)))","v":15000}]
["Gradiente (%):",{"$f":"IF(OR(B5=\"NÃO aplicável\",B4=\"não aplicável\"),\"NA\",IF(B4>2,0.02,IF(B4=1,0.05,0.04)))","v":0.02},null,null,{"$f":"IF(OR(E5=\"NÃO aplicável\",E4=\"não aplicável\"),\"NA\",IF(E4>2,0.02,IF(E4=1,0.05,0.04)))","v":0.02},null,null,{"$f":"IF(OR(H5=\"NÃO aplicável\",H4=\"não aplicável\"),\"NA\",IF(H4>2,0.02,IF(H4=1,0.05,0.04)))","v":0.04},null,null,{"$f":"IF(OR(K5=\"NÃO aplicável\",K4=\"não aplicável\"),\"NA\",IF(K4>2,0.02,IF(K4=1,0.05,0.04)))","v":0.04},null,null,{"$f":"IF(OR(N5=\"NÃO aplicável\",N4=\"não aplicável\"),\"NA\",IF(N4>2,0.02,IF(N4=1,0.05,0.04)))","v":0.04},null,null,{"$f":"IF(OR(Q5=\"NÃO aplicável\",Q4=\"não aplicável\"),\"NA\",IF(Q4>2,0.02,IF(Q4=1,0.05,0.04)))","v":0.04}]
["Elevação da borda externa (m):",{"$f":"IF(OR(B5=\"NÃO aplicável\",B4=\"não aplicável\"),\"NA\",B2+B12*B13)","v":1086.3789999999999},null,null,{"$f":"IF(OR(E5=\"NÃO aplicável\",E4=\"não aplicável\"),\"NA\",E2+E12*E13)","v":1087.71},null,null,{"$f":"IF(OR(H5=\"NÃO aplicável\",H4=\"não aplicável\"),\"NA\",H2+H12*H13)","v":600},null,null,{"$f":"IF(OR(K5=\"NÃO aplicável\",K4=\"não aplicável\"),\"NA\",K2+K12*K13)","v":600},null,null,{"$f":"IF(OR(N5=\"NÃO aplicável\",N4=\"não aplicável\"),\"NA\",N2+N12*N13)","v":600},null,null,{"$f":"IF(OR(Q5=\"NÃO aplicável\",Q4=\"não aplicável\"),\"NA\",Q2+Q12*Q13)","v":600}]

{"sheet":"APROX","index":6,"n_rows":44,"n_cols":19,"rows_kept":44,"cut":false,"hidden":true,"merged":[]}
["CABECEIRA",{"$f":"FORMULÁRIO!C10","v":4.0082927954098135},null,null,{"$f":"FORMULÁRIO!C11","v":22.008292795409815},null,null,{"$f":"FORMULÁRIO!F11","v":0},null,null,{"$f":"FORMULÁRIO!I11","v":16.117999999999999},null,null,{"$f":"FORMULÁRIO!L11","v":0},null,null,{"$f":"FORMULÁRIO!O11","v":16.117999999999999}]
["ELEVAÇÃO DA CABECEIRA",{"$f":"FORMULÁRIO!C24","v":787.71},null,null,{"$f":"FORMULÁRIO!F24","v":786.37900000000002},null,null,{"$f":"FORMULÁRIO!I24","v":0},null,null,{"$f":"FORMULÁRIO!L24","v":0},null,null,{"$f":"FORMULÁRIO!O24","v":0},null,null,{"$f":"FORMULÁRIO!R24","v":0}]
["REFERENCIA",{"$f":"FORMULÁRIO!AA5-FORMULÁRIO!$C$8","v":40.082927954098132},null,null,{"$f":"FORMULÁRIO!AA4-FORMULÁRIO!C8","v":220.08292795409812},null,null,{"$f":"FORMULÁRIO!AB5-FORMULÁRIO!C8","v":-18.82},null,null,{"$f":"FORMULÁRIO!AB4-FORMULÁRIO!C8","v":161.18},null,null,{"$f":"FORMULÁRIO!AC5-FORMULÁRIO!C8","v":-18.82},null,null,{"$f":"FORMULÁRIO!AC4-FORMULÁRIO!C8","v":161.18}]
["ESQUERDA",{"$f":"MAX(B41:D42)","v":0},null,null,{"$f":"MAX(E41:G42)","v":0},null,null,0,null,null,0,null,null,{"$f":"MAX(N41:P42)","v":0},null,null,{"$f":"MAX(Q41:S42)","v":0}]
["DIREITA",{"$f":"MAX(B43:D43)","v":0},null,null,{"$f":"MAX(E43:G43)","v":0},null,null,{"$f":"MAX(H43:J43)","v":0},null,null,{"$f":"MAX(K43:M43)","v":0},null,null,{"$f":"MAX(N43:P43)","v":0},null,null,{"$f":"MAX(Q43:S43)","v":0}]
["DIVERGENCIA LADO ESQUERDO %",{"$f":"C6/100","v":0},null,null,{"$f":"F6/100","v":0},null,null,{"$f":"I6/100","v":0},null,null,{"$f":"L6/100","v":0},null,null,{"$f":"O6/100","v":0},null,null,{"$f":"R6/100","v":0}]
["DIVERGENCIA LADO DIREITO %",{"$f":"C7/100","v":0},null,null,{"$f":"F7/100","v":0},null,null,{"$f":"I7/100","v":0},null,null,{"$f":"L7/100","v":0},null,null,{"$f":"O7/100","v":0},null,null,{"$f":"R7/100","v":0}]
["ABERTURA ESQUERDA",{"$f":"B6+(IF(B11=\"VFR\",0.1,0.15))","v":0.1},null,null,{"$f":"E6+(IF(E11=\"VFR\",0.1,0.15))","v":0.1},null,null,0.15,null,null,0.15,null,null,{"$f":"N6+(IF(N11=\"VFR\",0.1,0.15))","v":0.15},null,null,{"$f":"Q6+(IF(Q11=\"VFR\",0.1,0.15))","v":0.15}]
["ABERTURA DIREITA",{"$f":"B7+(IF(B11=\"VFR\",0.1,0.15))","v":0.1},null,null,{"$f":"E7+(IF(E11=\"VFR\",0.1,0.15))","v":0.1},null,null,0.15,null,null,0.15,null,null,{"$f":"N7+(IF(N11=\"VFR\",0.1,0.15))","v":0.15},null,null,{"$f":"Q7+(IF(Q11=\"VFR\",0.1,0.15))","v":0.15}]
["CODIGO REFERENCIA APROXIMAÇÃO",{"$f":"FORMULÁRIO!C26","v":3},null,null,{"$f":"FORMULÁRIO!F26","v":3},null,null,{"$f":"FORMULÁRIO!I26","v":0},null,null,{"$f":"FORMULÁRIO!L26","v":0},null,null,{"$f":"FORMULÁRIO!O26","v":0},null,null,{"$f":"FORMULÁRIO!R26","v":0}]
["TIPO DE OPERAÇÃO (VFR, IFR OU IFR-P)",{"$f":"IF(FORMULÁRIO!C27=\"VFR\",FORMULÁRIO!C27,IF(FORMULÁRIO!C27=\"IFR NPA\",\"IFR\",IF(FORMULÁRIO!C27=\"Não Aplicável\",FORMULÁRIO!C27,\"IFR-P\")))","v":"VFR"},null,null,{"$f":"IF(FORMULÁRIO!F27=\"VFR\",FORMULÁRIO!F27,IF(FORMULÁRIO!F27=\"IFR NPA\",\"IFR\",IF(FORMULÁRIO!F27=\"Não Aplicável\",FORMULÁRIO!F27,\"IFR-P\")))","v":"VFR"},null,null,{"$f":"IF(FORMULÁRIO!I27=\"VFR\",FORMULÁRIO!I27,IF(FORMULÁRIO!I27=\"IFR NPA\",\"IFR\",IF(FORMULÁRIO!I27=\"Não Aplicável\",FORMULÁRIO!I27,\"IFR-P\")))","v":"IFR-P"},null,null,{"$f":"IF(FORMULÁRIO!L27=\"VFR\",FORMULÁRIO!L27,IF(FORMULÁRIO!L27=\"IFR NPA\",\"IFR\",IF(FORMULÁRIO!L27=\"Não Aplicável\",FORMULÁRIO!L27,\"IFR-P\")))","v":"IFR-P"},null,null,{"$f":"IF(FORMULÁRIO!O27=\"VFR\",FORMULÁRIO!O27,IF(FORMULÁRIO!O27=\"IFR NPA\",\"IFR\",IF(FORMULÁRIO!O27=\"Não Aplicável\",FORMULÁRIO!O27,\"IFR-P\")))","v":"IFR-P"},null,null,{"$f":"IF(FORMULÁRIO!R27=\"VFR\",FORMULÁRIO!R27,IF(FORMULÁRIO!R27=\"IFR NPA\",\"IFR\",IF(FORMULÁRIO!R27=\"Não Aplicável\",FORMULÁRIO!R27,\"IFR-P\")))","v":"IFR-P"}]
["Divergência lado direito (%):",{"$f":"IF(OR(B11=\"NÃO aplicável\",B10=\"não aplicável\"),\"NA\",B7)","v":0},null,null,{"$f":"IF(OR(E11=\"NÃO aplicável\",E10=\"não aplicável\"),\"NA\",E7)","v":0},null,null,{"$f":"IF(OR(H11=\"NÃO aplicável\",H10=\"não aplicável\"),\"NA\",H7)","v":0},null,null,{"$f":"IF(OR(K11=\"NÃO aplicável\",K10=\"não aplicável\"),\"NA\",K7)","v":0},null,null,{"$f":"IF(OR(N11=\"NÃO aplicável\",N10=\"não aplicável\"),\"NA\",N7)","v":0},null,null,{"$f":"IF(OR(Q11=\"NÃO aplicável\",Q10=\"não aplicável\"),\"NA\",Q7)","v":0}]
["Divergência lado esquerdo (%):",{"$f":"IF(OR(B11=\"NÃO aplicável\",B10=\"não aplicável\"),\"NA\",B6)","v":0},null,null,{"$f":"IF(OR(E11=\"NÃO aplicável\",E10=\"não aplicável\"),\"NA\",E6)","v":0},null,null,{"$f":"IF(OR(H11=\"NÃO aplicável\",H10=\"não aplicável\"),\"NA\",H6)","v":0},null,null,{"$f":"IF(OR(K11=\"NÃO aplicável\",K10=\"não aplicável\"),\"NA\",K6)","v":0},null,null,{"$f":"IF(OR(N11=\"NÃO aplicável\",N10=\"não aplicável\"),\"NA\",N6)","v":0},null,null,{"$f":"IF(OR(Q11=\"NÃO aplicável\",Q10=\"não aplicável\"),\"NA\",Q6)","v":0}]
["Comprimento total (m):",{"$f":"IF(OR(B11=\"NÃO aplicável\",B10=\"não aplicável\"),\"NA\",IF(B11=\"ifr-p\",15000,IF(B11=\"ifr\",IF(B10>2,15000,2500),IF(B10>2,3000,IF(B10=1,1600,2500)))))","v":3000},null,null,{"$f":"IF(OR(E11=\"NÃO aplicável\",E10=\"não aplicável\"),\"NA\",IF(E11=\"ifr-p\",15000,IF(E11=\"ifr\",IF(E10>2,15000,2500),IF(E10>2,3000,IF(E10=1,1600,2500)))))","v":3000},null,null,{"$f":"IF(OR(H11=\"NÃO aplicável\",H10=\"não aplicável\"),\"NA\",IF(H11=\"ifr-p\",15000,IF(H11=\"ifr\",IF(H10>2,15000,2500),IF(H10>2,3000,IF(H10=1,1600,2500)))))","v":15000},null,null,{"$f":"IF(OR(K11=\"NÃO aplicável\",K10=\"não aplicável\"),\"NA\",IF(K11=\"ifr-p\",15000,IF(K11=\"ifr\",IF(K10>2,15000,2500),IF(K10>2,3000,IF(K10=1,1600,2500)))))","v":15000},null,null,{"$f":"IF(OR(N11=\"NÃO aplicável\",N10=\"não aplicável\"),\"NA\",IF(N11=\"ifr-p\",15000,IF(N11=\"ifr\",IF(N10>2,15000,2500),IF(N10>2,3000,IF(N10=1,1600,2500)))))","v":15000},null,null,{"$f":"IF(OR(Q11=\"NÃO aplicável\",Q10=\"não aplicável\"),\"NA\",IF(Q11=\"ifr-p\",15000,IF(Q11=\"ifr\",IF(Q10>2,15000,2500),IF(Q10>2,3000,IF(Q10=1,1600,2500)))))","v":15000}]
["Primeira Seção"]
["Largura da borda interna (m):",{"$f":"IF(OR(B11=\"NÃO aplicável\",B10=\"não aplicável\"),\"NA\",IF(B11=\"VFR\",IF(B10=1,60,IF(B10=2,80,150)),IF(B10<3,150,300)))","v":150},null,null,{"$f":"IF(OR(E11=\"NÃO aplicável\",E10=\"não aplicável\"),\"NA\",IF(E11=\"VFR\",IF(E10=1,60,IF(E10=2,80,150)),IF(E10<3,150,300)))","v":150},null,null,{"$f":"IF(OR(H11=\"NÃO aplicável\",H10=\"não aplicável\"),\"NA\",IF(H11=\"VFR\",IF(H10=1,60,IF(H10=2,80,150)),IF(H10<3,150,300)))","v":150},null,null,{"$f":"IF(OR(K11=\"NÃO aplicável\",K10=\"não aplicável\"),\"NA\",IF(K11=\"VFR\",IF(K10=1,60,IF(K10=2,80,150)),IF(K10<3,150,300)))","v":150},null,null,{"$f":"IF(OR(N11=\"NÃO aplicável\",N10=\"não aplicável\"),\"NA\",IF(N11=\"VFR\",IF(N10=1,60,IF(N10=2,80,150)),IF(N10<3,150,300)))","v":150},null,null,{"$f":"IF(OR(Q11=\"NÃO aplicável\",Q10=\"não aplicável\"),\"NA\",IF(Q11=\"VFR\",IF(Q10=1,60,IF(Q10=2,80,150)),IF(Q10<3,150,300)))","v":150}]
["Elevação da borda interna (m):",{"$f":"IF(OR(B11=\"NÃO aplicável\",B10=\"não aplicável\"),\"NA\",B2)","v":787.71},null,null,{"$f":"IF(OR(E11=\"NÃO aplicável\",E10=\"não aplicável\"),\"NA\",E2)","v":786.37900000000002},null,null,{"$f":"IF(OR(H11=\"NÃO aplicável\",H10=\"não aplicável\"),\"NA\",H2)","v":0},null,null,{"$f":"IF(OR(K11=\"NÃO aplicável\",K10=\"não aplicável\"),\"NA\",K2)","v":0},null,null,{"$f":"IF(OR(N11=\"NÃO aplicável\",N10=\"não aplicável\"),\"NA\",N2)","v":0},null,null,{"$f":"IF(OR(Q11=\"NÃO aplicável\",Q10=\"não aplicável\"),\"NA\",Q2)","v":0}]
["Distância da cabeceira (m):",{"$f":"IF(OR(B11=\"NÃO aplicável\",B10=\"não aplicável\"),\"NA\",IF(B11=\"VFR\",IF(B10=1,30,60),60))","v":60},null,null,{"$f":"IF(OR(E11=\"NÃO aplicável\",E10=\"não aplicável\"),\"NA\",IF(E11=\"VFR\",IF(E10=1,30,60),60))","v":60},null,null,{"$f":"IF(OR(H11=\"NÃO aplicável\",H10=\"não aplicável\"),\"NA\",IF(H11=\"VFR\",IF(H10=1,30,60),60))","v":60},null,null,{"$f":"IF(OR(K11=\"NÃO aplicável\",K10=\"não aplicável\"),\"NA\",IF(K11=\"VFR\",IF(K10=1,30,60),60))","v":60},null,null,{"$f":"IF(OR(N11=\"NÃO aplicável\",N10=\"não aplicável\"),\"NA\",IF(N11=\"VFR\",IF(N10=1,30,60),60))","v":60},null,null,{"$f":"IF(OR(Q11=\"NÃO aplicável\",Q10=\"não aplicável\"),\"NA\",IF(Q11=\"VFR\",IF(Q10=1,30,60),60))","v":60}]
["Abertura total lado direito (%):",{"$f":"IF(OR(B11=\"NÃO aplicável\",B10=\"não aplicável\"),\"NA\",B9)","v":0.1},null,null,{"$f":"IF(OR(E11=\"NÃO aplicável\",E10=\"não aplicável\"),\"NA\",E9)","v":0.1},null,null,{"$f":"IF(OR(H11=\"NÃO aplicável\",H10=\"não aplicável\"),\"NA\",H9)","v":0.15},null,null,{"$f":"IF(OR(K11=\"NÃO aplicável\",K10=\"não aplicável\"),\"NA\",K9)","v":0.15},null,null,{"$f":"IF(OR(N11=\"NÃO aplicável\",N10=\"não aplicável\"),\"NA\",N9)","v":0.15},null,null,{"$f":"IF(OR(Q11=\"NÃO aplicável\",Q10=\"não aplicável\"),\"NA\",Q9)","v":0.15}]
["Abertura total lado esquerdo (%):",{"$f":"IF(OR(B11=\"NÃO aplicável\",B10=\"não aplicável\"),\"NA\",B8)","v":0.1},null,null,{"$f":"IF(OR(E11=\"NÃO aplicável\",E10=\"não aplicável\"),\"NA\",E8)","v":0.1},null,null,{"$f":"IF(OR(H11=\"NÃO aplicável\",H10=\"não aplicável\"),\"NA\",H8)","v":0.15},null,null,{"$f":"IF(OR(K11=\"NÃO aplicável\",K10=\"não aplicável\"),\"NA\",K8)","v":0.15},null,null,{"$f":"IF(OR(N11=\"NÃO aplicável\",N10=\"não aplicável\"),\"NA\",N8)","v":0.15},null,null,{"$f":"IF(OR(Q11=\"NÃO aplicável\",Q10=\"não aplicável\"),\"NA\",Q8)","v":0.15}]
["Comprimento (m):",{"$f":"IF(OR(B11=\"NÃO aplicável\",B10=\"não aplicável\"),\"NA\",IF(B10<3,IF(AND(B10=1,B11=\"VFR\"),1600,IF(B11=\"IFR-P\",3000,2500)),3000))","v":3000},null,null,{"$f":"IF(OR(E11=\"NÃO aplicável\",E10=\"não aplicável\"),\"NA\",IF(E10<3,IF(AND(E10=1,E11=\"VFR\"),1600,IF(E11=\"IFR-P\",3000,2500)),3000))","v":3000},null,null,{"$f":"IF(OR(H11=\"NÃO aplicável\",H10=\"não aplicável\"),\"NA\",IF(H10<3,IF(AND(H10=1,H11=\"VFR\"),1600,IF(H11=\"IFR-P\",3000,2500)),3000))","v":3000},null,null,{"$f":"IF(OR(K11=\"NÃO aplicável\",K10=\"não aplicável\"),\"NA\",IF(K10<3,IF(AND(K10=1,K11=\"VFR\"),1600,IF(K11=\"IFR-P\",3000,2500)),3000))","v":3000},null,null,{"$f":"IF(OR(N11=\"NÃO aplicável\",N10=\"não aplicável\"),\"NA\",IF(N10<3,IF(AND(N10=1,N11=\"VFR\"),1600,IF(N11=\"IFR-P\",3000,2500)),3000))","v":3000},null,null,{"$f":"IF(OR(Q11=\"NÃO aplicável\",Q10=\"não aplicável\"),\"NA\",IF(Q10<3,IF(AND(Q10=1,Q11=\"VFR\"),1600,IF(Q11=\"IFR-P\",3000,2500)),3000))","v":3000}]
["Gradiente (%):",{"$f":"IF(OR(B11=\"NÃO aplicável\",B10=\"não aplicável\"),\"NA\",IF(B11=\"VFR\",IF(B10=1,0.05,IF(B10=2,0.04,IF(B10=3,0.0333,0.025))),IF(AND(B11=\"IFR\",B10<3),0.0333,IF(AND(B11=\"IFR-P\",B10<3),0.025,0.02))))","v":3.3300000000000003E-2},null,null,{"$f":"IF(OR(E11=\"NÃO aplicável\",E10=\"não aplicável\"),\"NA\",IF(E11=\"VFR\",IF(E10=1,0.05,IF(E10=2,0.04,IF(E10=3,0.0333,0.025))),IF(AND(E11=\"IFR\",E10<3),0.0333,IF(AND(E11=\"IFR-P\",E10<3),0.025,0.02))))","v":3.3300000000000003E-2},null,null,{"$f":"IF(OR(H11=\"NÃO aplicável\",H10=\"não aplicável\"),\"NA\",IF(H11=\"VFR\",IF(H10=1,0.05,IF(H10=2,0.04,IF(H10=3,0.0333,0.025))),IF(AND(H11=\"IFR\",H10<3),0.0333,IF(AND(H11=\"IFR-P\",H10<3),0.025,0.02))))","v":2.5000000000000001E-2},null,null,{"$f":"IF(OR(K11=\"NÃO aplicável\",K10=\"não aplicável\"),\"NA\",IF(K11=\"VFR\",IF(K10=1,0.05,IF(K10=2,0.04,IF(K10=3,0.0333,0.025))),IF(AND(K11=\"IFR\",K10<3),0.0333,IF(AND(K11=\"IFR-P\",K10<3),0.025,0.02))))","v":2.5000000000000001E-2},null,null,{"$f":"IF(OR(N11=\"NÃO aplicável\",N10=\"não aplicável\"),\"NA\",IF(N11=\"VFR\",IF(N10=1,0.05,IF(N10=2,0.04,IF(N10=3,0.0333,0.025))),IF(AND(N11=\"IFR\",N10<3),0.0333,IF(AND(N11=\"IFR-P\",N10<3),0.025,0.02))))","v":2.5000000000000001E-2},null,null,{"$f":"IF(OR(Q11=\"NÃO aplicável\",Q10=\"não aplicável\"),\"NA\",IF(Q11=\"VFR\",IF(Q10=1,0.05,IF(Q10=2,0.04,IF(Q10=3,0.0333,0.025))),IF(AND(Q11=\"IFR\",Q10<3),0.0333,IF(AND(Q11=\"IFR-P\",Q10<3),0.025,0.02))))","v":2.5000000000000001E-2}]
["Elevação da borda externa (m):",{"$f":"IF(OR(B11=\"NÃO aplicável\",B10=\"não aplicável\"),\"NA\",B21*B22+B2)","v":887.61},null,null,{"$f":"IF(OR(E11=\"NÃO aplicável\",E10=\"não aplicável\"),\"NA\",E21*E22+E2)","v":886.279},null,null,{"$f":"IF(OR(H11=\"NÃO aplicável\",H10=\"não aplicável\"),\"NA\",H21*H22+H2)","v":75},null,null,{"$f":"IF(OR(K11=\"NÃO aplicável\",K10=\"não aplicável\"),\"NA\",K21*K22+K2)","v":75},null,null,{"$f":"IF(OR(N11=\"NÃO aplicável\",N10=\"não aplicável\"),\"NA\",N21*N22+N2)","v":75},null,null,{"$f":"IF(OR(Q11=\"NÃO aplicável\",Q10=\"não aplicável\"),\"NA\",Q21*Q22+Q2)","v":75}]
["Segunda Seção",{"$f":"IF(OR(B11=\"NÃO aplicável\",B10=\"não aplicável\"),\"NA\",IF(B11=\"ifr-p\",IF(B10<3,12000,3600),IF(B11=\"vfr\",0,IF(B10>2,3600,0))))","v":0},null,null,{"$f":"IF(OR(E11=\"NÃO aplicável\",E10=\"não aplicável\"),\"NA\",IF(E11=\"ifr-p\",IF(E10<3,12000,3600),IF(E11=\"vfr\",0,IF(E10>2,3600,0))))","v":0},null,null,{"$f":"IF(OR(H11=\"NÃO aplicável\",H10=\"não aplicável\"),\"NA\",IF(H11=\"ifr-p\",IF(H10<3,12000,3600),IF(H11=\"vfr\",0,IF(H10>2,3600,0))))","v":12000},null,null,{"$f":"IF(OR(K11=\"NÃO aplicável\",K10=\"não aplicável\"),\"NA\",IF(K11=\"ifr-p\",IF(K10<3,12000,3600),IF(K11=\"vfr\",0,IF(K10>2,3600,0))))","v":12000},null,null,{"$f":"IF(OR(N11=\"NÃO aplicável\",N10=\"não aplicável\"),\"NA\",IF(N11=\"ifr-p\",IF(N10<3,12000,3600),IF(N11=\"vfr\",0,IF(N10>2,3600,0))))","v":12000},null,null,{"$f":"IF(OR(Q11=\"NÃO aplicável\",Q10=\"não aplicável\"),\"NA\",IF(Q11=\"ifr-p\",IF(Q10<3,12000,3600),IF(Q11=\"vfr\",0,IF(Q10>2,3600,0))))","v":12000}]
["Largura da borda interna (m):",{"$f":"IF(OR(B11=\"NÃO aplicável\",B10=\"não aplicável\"),\"NA\",IF(B24>0,(B16+B21*(B8+B9)),\"NA\"))","v":"NA"},null,null,{"$f":"IF(OR(E11=\"NÃO aplicável\",E10=\"não aplicável\"),\"NA\",IF(E24>0,(E16+E21*(E8+E9)),\"NA\"))","v":"NA"},null,null,{"$f":"IF(OR(H11=\"NÃO aplicável\",H10=\"não aplicável\"),\"NA\",IF(H24>0,(H16+H21*(H8+H9)),\"NA\"))","v":1050},null,null,{"$f":"IF(OR(K11=\"NÃO aplicável\",K10=\"não aplicável\"),\"NA\",IF(K24>0,(K16+K21*(K8+K9)),\"NA\"))","v":1050},null,null,{"$f":"IF(OR(N11=\"NÃO aplicável\",N10=\"não aplicável\"),\"NA\",IF(N24>0,(N16+N21*(N8+N9)),\"NA\"))","v":1050},null,null,{"$f":"IF(OR(Q11=\"NÃO aplicável\",Q10=\"não aplicável\"),\"NA\",IF(Q24>0,(Q16+Q21*(Q8+Q9)),\"NA\"))","v":1050}]
["Elevação da borda interna (m):",{"$f":"IF(B24=0,\"NA\",B23)","v":"NA"},null,null,{"$f":"IF(E24=0,\"NA\",E23)","v":"NA"},null,null,75,null,null,75,null,null,{"$f":"IF(N24=0,\"NA\",N23)","v":75},null,null,{"$f":"IF(Q24=0,\"NA\",Q23)","v":75}]
["Abertura total lado direito (%):",{"$f":"IF(OR(B11=\"NÃO aplicável\",B10=\"não aplicável\"),\"NA\",IF(B24=0,\"NA\",B9))","v":"NA"},null,null,{"$f":"IF(OR(E11=\"NÃO aplicável\",E10=\"não aplicável\"),\"NA\",IF(E24=0,\"NA\",E9))","v":"NA"},null,null,{"$f":"IF(OR(H11=\"NÃO aplicável\",H10=\"não aplicável\"),\"NA\",IF(H24=0,\"NA\",H9))","v":0.15},null,null,{"$f":"IF(OR(K11=\"NÃO aplicável\",K10=\"não aplicável\"),\"NA\",IF(K24=0,\"NA\",K9))","v":0.15},null,null,{"$f":"IF(OR(N11=\"NÃO aplicável\",N10=\"não aplicável\"),\"NA\",IF(N24=0,\"NA\",N9))","v":0.15},null,null,{"$f":"IF(OR(Q11=\"NÃO aplicável\",Q10=\"não aplicável\"),\"NA\",IF(Q24=0,\"NA\",Q9))","v":0.15}]
["Abertura total lado esquerdo (%):",{"$f":"IF(OR(B11=\"NÃO aplicável\",B10=\"não aplicável\"),\"NA\",IF(B24=0,\"NA\",B8))","v":"NA"},null,null,{"$f":"IF(OR(E11=\"NÃO aplicável\",E10=\"não aplicável\"),\"NA\",IF(E24=0,\"NA\",E8))","v":"NA"},null,null,{"$f":"IF(OR(H11=\"NÃO aplicável\",H10=\"não aplicável\"),\"NA\",IF(H24=0,\"NA\",H8))","v":0.15},null,null,{"$f":"IF(OR(K11=\"NÃO aplicável\",K10=\"não aplicável\"),\"NA\",IF(K24=0,\"NA\",K8))","v":0.15},null,null,{"$f":"IF(OR(N11=\"NÃO aplicável\",N10=\"não aplicável\"),\"NA\",IF(N24=0,\"NA\",N8))","v":0.15},null,null,{"$f":"IF(OR(Q11=\"NÃO aplicável\",Q10=\"não aplicável\"),\"NA\",IF(Q24=0,\"NA\",Q8))","v":0.15}]
["Comprimento (m):",{"$f":"IF(OR(B11=\"NÃO aplicável\",B10=\"não aplicável\"),\"NA\",IF(B24>0,IF(MIN(B39:D40)<150,3600,(MIN(B39:D40)-150)/B30+3600),\"NA\"))","v":"NA"},null,null,{"$f":"IF(OR(E11=\"NÃO aplicável\",E10=\"não aplicável\"),\"NA\",IF(E24>0,IF(MIN(E39:G40)<150,3600,(MIN(E39:G40)-150)/E30+3600),\"NA\"))","v":"NA"},null,null,{"$f":"IF(OR(H11=\"NÃO aplicável\",H10=\"não aplicável\"),\"NA\",IF(H24>0,IF(MIN(H39:J40)<150,3600,(MIN(H39:J40)-150)/H30+3600),\"NA\"))","v":3600},null,null,{"$f":"IF(OR(K11=\"NÃO aplicável\",K10=\"não aplicável\"),\"NA\",IF(K24>0,IF(MIN(K39:M40)<150,3600,(MIN(K39:M40)-150)/K30+3600),\"NA\"))","v":3600},null,null,{"$f":"IF(OR(N11=\"NÃO aplicável\",N10=\"não aplicável\"),\"NA\",IF(N24>0,IF(MIN(N39:P40)<150,3600,(MIN(N39:P40)-150)/N30+3600),\"NA\"))","v":3600},null,null,{"$f":"IF(OR(Q11=\"NÃO aplicável\",Q10=\"não aplicável\"),\"NA\",IF(Q24>0,IF(MIN(Q39:S40)<150,3600,(MIN(Q39:S40)-150)/Q30+3600),\"NA\"))","v":3600}]
["Gradiente (%):",{"$f":"IF(OR(B11=\"NÃO aplicável\",B10=\"não aplicável\"),\"NA\",IF(B24>0,IF(B10>2,0.025,0.03),\"NA\"))","v":"NA"},null,null,{"$f":"IF(OR(E11=\"NÃO aplicável\",E10=\"não aplicável\"),\"NA\",IF(E24>0,IF(E10>2,0.025,0.03),\"NA\"))","v":"NA"},null,null,{"$f":"IF(OR(H11=\"NÃO aplicável\",H10=\"não aplicável\"),\"NA\",IF(H24>0,IF(H10>2,0.025,0.03),\"NA\"))","v":0.03},null,null,{"$f":"IF(OR(K11=\"NÃO aplicável\",K10=\"não aplicável\"),\"NA\",IF(K24>0,IF(K10>2,0.025,0.03),\"NA\"))","v":0.03},null,null,{"$f":"IF(OR(N11=\"NÃO aplicável\",N10=\"não aplicável\"),\"NA\",IF(N24>0,IF(N10>2,0.025,0.03),\"NA\"))","v":0.03},null,null,{"$f":"IF(OR(Q11=\"NÃO aplicável\",Q10=\"não aplicável\"),\"NA\",IF(Q24>0,IF(Q10>2,0.025,0.03),\"NA\"))","v":0.03}]
["Elevação da borda externa (m):",{"$f":"IF(OR(B11=\"NÃO aplicável\",B10=\"não aplicável\"),\"NA\",IF(B24>0,B23+B29*B30,\"NA\"))","v":"NA"},null,null,{"$f":"IF(OR(E11=\"NÃO aplicável\",E10=\"não aplicável\"),\"NA\",IF(E24>0,E23+E29*E30,\"NA\"))","v":"NA"},null,null,{"$f":"IF(OR(H11=\"NÃO aplicável\",H10=\"não aplicável\"),\"NA\",IF(H24>0,H23+H29*H30,\"NA\"))","v":183},null,null,{"$f":"IF(OR(K11=\"NÃO aplicável\",K10=\"não aplicável\"),\"NA\",IF(K24>0,K23+K29*K30,\"NA\"))","v":183},null,null,{"$f":"IF(OR(N11=\"NÃO aplicável\",N10=\"não aplicável\"),\"NA\",IF(N24>0,N23+N29*N30,\"NA\"))","v":183},null,null,{"$f":"IF(OR(Q11=\"NÃO aplicável\",Q10=\"não aplicável\"),\"NA\",IF(Q24>0,Q23+Q29*Q30,\"NA\"))","v":183}]
["Seção Horizontal"]
["Largura da borda interna (m):",{"$f":"IF(OR(B11=\"NÃO aplicável\",B10=\"não aplicável\"),\"NA\",IF(B24>0,B16/2+(B21+B29)*B8+B16/2+(B21+B29)*B9,\"NA\"))","v":"NA"},null,null,{"$f":"IF(OR(E11=\"NÃO aplicável\",E10=\"não aplicável\"),\"NA\",IF(E24>0,E16/2+(E21+E29)*E8+E16/2+(E21+E29)*E9,\"NA\"))","v":"NA"},null,null,{"$f":"IF(OR(H11=\"NÃO aplicável\",H10=\"não aplicável\"),\"NA\",IF(H24>0,H16/2+(H21+H29)*H8+H16/2+(H21+H29)*H9,\"NA\"))","v":2130},null,null,{"$f":"IF(OR(K11=\"NÃO aplicável\",K10=\"não aplicável\"),\"NA\",IF(K24>0,K16/2+(K21+K29)*K8+K16/2+(K21+K29)*K9,\"NA\"))","v":2130},null,null,{"$f":"IF(OR(N11=\"NÃO aplicável\",N10=\"não aplicável\"),\"NA\",IF(N24>0,N16/2+(N21+N29)*N8+N16/2+(N21+N29)*N9,\"NA\"))","v":2130},null,null,{"$f":"IF(OR(Q11=\"NÃO aplicável\",Q10=\"não aplicável\"),\"NA\",IF(Q24>0,Q16/2+(Q21+Q29)*Q8+Q16/2+(Q21+Q29)*Q9,\"NA\"))","v":2130}]
["Abertura total lado direito (%):",{"$f":"IF(OR(B11=\"NÃO aplicável\",B10=\"não aplicável\"),\"NA\",IF(B24=0,\"NA\",B9))","v":"NA"},null,null,{"$f":"IF(OR(E11=\"NÃO aplicável\",E10=\"não aplicável\"),\"NA\",IF(E24=0,\"NA\",E9))","v":"NA"},null,null,{"$f":"IF(OR(H11=\"NÃO aplicável\",H10=\"não aplicável\"),\"NA\",IF(H24=0,\"NA\",H9))","v":0.15},null,null,{"$f":"IF(OR(K11=\"NÃO aplicável\",K10=\"não aplicável\"),\"NA\",IF(K24=0,\"NA\",K9))","v":0.15},null,null,{"$f":"IF(OR(N11=\"NÃO aplicável\",N10=\"não aplicável\"),\"NA\",IF(N24=0,\"NA\",N9))","v":0.15},null,null,{"$f":"IF(OR(Q11=\"NÃO aplicável\",Q10=\"não aplicável\"),\"NA\",IF(Q24=0,\"NA\",Q9))","v":0.15}]
["Abertura total lado esquerdo (%):",{"$f":"IF(OR(B11=\"NÃO aplicável\",B10=\"não aplicável\"),\"NA\",IF(B24=0,\"NA\",B8))","v":"NA"},null,null,{"$f":"IF(OR(E11=\"NÃO aplicável\",E10=\"não aplicável\"),\"NA\",IF(E24=0,\"NA\",E8))","v":"NA"},null,null,{"$f":"IF(OR(H11=\"NÃO aplicável\",H10=\"não aplicável\"),\"NA\",IF(H24=0,\"NA\",H8))","v":0.15},null,null,{"$f":"IF(OR(K11=\"NÃO aplicável\",K10=\"não aplicável\"),\"NA\",IF(K24=0,\"NA\",K8))","v":0.15},null,null,{"$f":"IF(OR(N11=\"NÃO aplicável\",N10=\"não aplicável\"),\"NA\",IF(N24=0,\"NA\",N8))","v":0.15},null,null,{"$f":"IF(OR(Q11=\"NÃO aplicável\",Q10=\"não aplicável\"),\"NA\",IF(Q24=0,\"NA\",Q8))","v":0.15}]
["Comprimento (m):",{"$f":"IF(OR(B11=\"NÃO aplicável\",B10=\"não aplicável\"),\"NA\",IF(B24>0,IF(B10>2,15000-B29-B21,\"NA\"),\"NA\"))","v":"NA"},null,null,{"$f":"IF(OR(E11=\"NÃO aplicável\",E10=\"não aplicável\"),\"NA\",IF(E24>0,IF(E10>2,15000-E29-E21,\"NA\"),\"NA\"))","v":"NA"},null,null,{"$f":"IF(OR(H11=\"NÃO aplicável\",H10=\"não aplicável\"),\"NA\",IF(H24>0,IF(H10>2,15000-H29-H21,\"NA\"),\"NA\"))","v":"NA"},null,null,{"$f":"IF(OR(K11=\"NÃO aplicável\",K10=\"não aplicável\"),\"NA\",IF(K24>0,IF(K10>2,15000-K29-K21,\"NA\"),\"NA\"))","v":"NA"},null,null,{"$f":"IF(OR(N11=\"NÃO aplicável\",N10=\"não aplicável\"),\"NA\",IF(N24>0,IF(N10>2,15000-N29-N21,\"NA\"),\"NA\"))","v":"NA"},null,null,{"$f":"IF(OR(Q11=\"NÃO aplicável\",Q10=\"não aplicável\"),\"NA\",IF(Q24>0,IF(Q10>2,15000-Q29-Q21,\"NA\"),\"NA\"))","v":"NA"}]
["Desnível (m):",{"$f":"B31","v":"NA"},null,null,{"$f":"E31","v":"NA"},null,null,183,null,null,183,null,null,{"$f":"N31","v":183},null,null,{"$f":"Q31","v":183}]
[]
[null,{"$f":"IF(FORMULÁRIO!C33=0,\"na\",FORMULÁRIO!C33/3.2808-FORMULÁRIO!C34)","v":"na"},{"$f":"IF(FORMULÁRIO!D33=0,\"na\",FORMULÁRIO!D33/3.2808-FORMULÁRIO!D34)","v":"na"},{"$f":"IF(FORMULÁRIO!E33=0,\"na\",FORMULÁRIO!E33/3.2808-FORMULÁRIO!E34)","v":"na"},{"$f":"IF(FORMULÁRIO!F33=0,\"na\",FORMULÁRIO!F33/3.2808-FORMULÁRIO!F34)","v":"na"},{"$f":"IF(FORMULÁRIO!G33=0,\"na\",FORMULÁRIO!G33/3.2808-FORMULÁRIO!G34)","v":"na"},{"$f":"IF(FORMULÁRIO!H33=0,\"na\",FORMULÁRIO!H33/3.2808-FORMULÁRIO!H34)","v":"na"},{"$f":"IF(FORMULÁRIO!I33=0,\"na\",FORMULÁRIO!I33/3.2808-FORMULÁRIO!I34)","v":"na"},{"$f":"IF(FORMULÁRIO!J33=0,\"na\",FORMULÁRIO!J33/3.2808-FORMULÁRIO!J34)","v":"na"},{"$f":"IF(FORMULÁRIO!K33=0,\"na\",FORMULÁRIO!K33/3.2808-FORMULÁRIO!K34)","v":"na"},{"$f":"IF(FORMULÁRIO!L33=0,\"na\",FORMULÁRIO!L33/3.2808-FORMULÁRIO!L34)","v":"na"},{"$f":"IF(FORMULÁRIO!M33=0,\"na\",FORMULÁRIO!M33/3.2808-FORMULÁRIO!M34)","v":"na"},{"$f":"IF(FORMULÁRIO!N33=0,\"na\",FORMULÁRIO!N33/3.2808-FORMULÁRIO!N34)","v":"na"},{"$f":"IF(FORMULÁRIO!O33=0,\"na\",FORMULÁRIO!O33/3.2808-FORMULÁRIO!O34)","v":"na"},{"$f":"IF(FORMULÁRIO!P33=0,\"na\",FORMULÁRIO!P33/3.2808-FORMULÁRIO!P34)","v":"na"},{"$f":"IF(FORMULÁRIO!Q33=0,\"na\",FORMULÁRIO!Q33/3.2808-FORMULÁRIO!Q34)","v":"na"},{"$f":"IF(FORMULÁRIO!R33=0,\"na\",FORMULÁRIO!R33/3.2808-FORMULÁRIO!R34)","v":"na"},{"$f":"IF(FORMULÁRIO!S33=0,\"na\",FORMULÁRIO!S33/3.2808-FORMULÁRIO!S34)","v":"na"},{"$f":"IF(FORMULÁRIO!T33=0,\"na\",FORMULÁRIO!T33/3.2808-FORMULÁRIO!T34)","v":"na"}]
[null,{"$f":"IF(FORMULÁRIO!C38=0,\"na\",FORMULÁRIO!C38/3.2808-FORMULÁRIO!C37)","v":"na"},{"$f":"IF(FORMULÁRIO!D36=0,\"na\",FORMULÁRIO!D36/3.2808-FORMULÁRIO!D37)","v":"na"},{"$f":"IF(FORMULÁRIO!E36=0,\"na\",FORMULÁRIO!E36/3.2808-FORMULÁRIO!E37)","v":"na"},{"$f":"IF(FORMULÁRIO!F36=0,\"na\",FORMULÁRIO!F36/3.2808-FORMULÁRIO!F37)","v":"na"},{"$f":"IF(FORMULÁRIO!G36=0,\"na\",FORMULÁRIO!G36/3.2808-FORMULÁRIO!G37)","v":"na"},{"$f":"IF(FORMULÁRIO!H36=0,\"na\",FORMULÁRIO!H36/3.2808-FORMULÁRIO!H37)","v":"na"},{"$f":"IF(FORMULÁRIO!I36=0,\"na\",FORMULÁRIO!I36/3.2808-FORMULÁRIO!I37)","v":"na"},{"$f":"IF(FORMULÁRIO!J36=0,\"na\",FORMULÁRIO!J36/3.2808-FORMULÁRIO!J37)","v":"na"},{"$f":"IF(FORMULÁRIO!K36=0,\"na\",FORMULÁRIO!K36/3.2808-FORMULÁRIO!K37)","v":"na"},{"$f":"IF(FORMULÁRIO!L36=0,\"na\",FORMULÁRIO!L36/3.2808-FORMULÁRIO!L37)","v":"na"},{"$f":"IF(FORMULÁRIO!M36=0,\"na\",FORMULÁRIO!M36/3.2808-FORMULÁRIO!M37)","v":"na"},{"$f":"IF(FORMULÁRIO!N36=0,\"na\",FORMULÁRIO!N36/3.2808-FORMULÁRIO!N37)","v":"na"},{"$f":"IF(FORMULÁRIO!O36=0,\"na\",FORMULÁRIO!O36/3.2808-FORMULÁRIO!O37)","v":"na"},{"$f":"IF(FORMULÁRIO!P36=0,\"na\",FORMULÁRIO!P36/3.2808-FORMULÁRIO!P37)","v":"na"},{"$f":"IF(FORMULÁRIO!Q36=0,\"na\",FORMULÁRIO!Q36/3.2808-FORMULÁRIO!Q37)","v":"na"},{"$f":"IF(FORMULÁRIO!R36=0,\"na\",FORMULÁRIO!R36/3.2808-FORMULÁRIO!R37)","v":"na"},{"$f":"IF(FORMULÁRIO!S36=0,\"na\",FORMULÁRIO!S36/3.2808-FORMULÁRIO!S37)","v":"na"},{"$f":"IF(FORMULÁRIO!T36=0,\"na\",FORMULÁRIO!T36/3.2808-FORMULÁRIO!T37)","v":"na"}]
["esquerda",{"$f":"IF(FORMULÁRIO!C35=0,\"na\",IF(FORMULÁRIO!C35>APROX!$B$3,FORMULÁRIO!C35-APROX!$B$3,IF(APROX!$B$3-FORMULÁRIO!C35>90,FORMULÁRIO!C35-APROX!$B$3+360,0)))","v":"na"},{"$f":"IF(FORMULÁRIO!D35=0,\"na\",IF(FORMULÁRIO!D35>APROX!$B$3,FORMULÁRIO!D35-APROX!$B$3,IF(APROX!$B$3-FORMULÁRIO!D35>90,FORMULÁRIO!D35-APROX!$B$3+360,0)))","v":"na"},{"$f":"IF(FORMULÁRIO!E35=0,\"na\",IF(FORMULÁRIO!E35>APROX!$B$3,FORMULÁRIO!E35-APROX!$B$3,IF(APROX!$B$3-FORMULÁRIO!E35>90,FORMULÁRIO!E35-APROX!$B$3+360,0)))","v":"na"},{"$f":"IF(FORMULÁRIO!F35=0,\"na\",IF(FORMULÁRIO!F35>APROX!$E$3,FORMULÁRIO!F35-APROX!$E$3,IF(APROX!$E$3-FORMULÁRIO!F35>90,FORMULÁRIO!F35-APROX!$E$3+360,0)))","v":"na"},{"$f":"IF(FORMULÁRIO!G35=0,\"na\",IF(FORMULÁRIO!G35>APROX!$E$3,FORMULÁRIO!G35-APROX!$E$3,IF(APROX!$E$3-FORMULÁRIO!G35>90,FORMULÁRIO!G35-APROX!$E$3+360,0)))","v":"na"},{"$f":"IF(FORMULÁRIO!H35=0,\"na\",IF(FORMULÁRIO!H35>APROX!$E$3,FORMULÁRIO!H35-APROX!$E$3,IF(APROX!$E$3-FORMULÁRIO!H35>90,FORMULÁRIO!H35-APROX!$E$3+360,0)))","v":"na"},{"$f":"IF(FORMULÁRIO!I35=0,\"na\",IF(FORMULÁRIO!I35>APROX!$H$3,FORMULÁRIO!I35-APROX!$H$3,IF(APROX!$H$3-FORMULÁRIO!I35>90,FORMULÁRIO!I35-APROX!$H$3+360,0)))","v":"na"},{"$f":"IF(FORMULÁRIO!J35=0,\"na\",IF(FORMULÁRIO!J35>APROX!$H$3,FORMULÁRIO!J35-APROX!$H$3,IF(APROX!$H$3-FORMULÁRIO!J35>90,FORMULÁRIO!J35-APROX!$H$3+360,0)))","v":"na"},{"$f":"IF(FORMULÁRIO!K35=0,\"na\",IF(FORMULÁRIO!K35>APROX!$H$3,FORMULÁRIO!K35-APROX!$H$3,IF(APROX!$H$3-FORMULÁRIO!K35>90,FORMULÁRIO!K35-APROX!$H$3+360,0)))","v":"na"},{"$f":"IF(FORMULÁRIO!L35=0,\"na\",IF(FORMULÁRIO!L35>APROX!$K$3,FORMULÁRIO!L35-APROX!$K$3,IF(APROX!$K$3-FORMULÁRIO!L35>90,FORMULÁRIO!L35-APROX!$K$3+360,0)))","v":"na"},{"$f":"IF(FORMULÁRIO!M35=0,\"na\",IF(FORMULÁRIO!M35>APROX!$K$3,FORMULÁRIO!M35-APROX!$K$3,IF(APROX!$K$3-FORMULÁRIO!M35>90,FORMULÁRIO!M35-APROX!$K$3+360,0)))","v":"na"},{"$f":"IF(FORMULÁRIO!N35=0,\"na\",IF(FORMULÁRIO!N35>APROX!$K$3,FORMULÁRIO!N35-APROX!$K$3,IF(APROX!$K$3-FORMULÁRIO!N35>90,FORMULÁRIO!N35-APROX!$K$3+360,0)))","v":"na"},{"$f":"IF(FORMULÁRIO!O35=0,\"na\",IF(FORMULÁRIO!O35>APROX!$N$3,FORMULÁRIO!O35-APROX!$N$3,IF(APROX!$N$3-FORMULÁRIO!O35>90,FORMULÁRIO!O35-APROX!$N$3+360,0)))","v":"na"},{"$f":"IF(FORMULÁRIO!P35=0,\"na\",IF(FORMULÁRIO!P35>APROX!$N$3,FORMULÁRIO!P35-APROX!$N$3,IF(APROX!$N$3-FORMULÁRIO!P35>90,FORMULÁRIO!P35-APROX!$N$3+360,0)))","v":"na"},{"$f":"IF(FORMULÁRIO!Q35=0,\"na\",IF(FORMULÁRIO!Q35>APROX!$N$3,FORMULÁRIO!Q35-APROX!$N$3,IF(APROX!$N$3-FORMULÁRIO!Q35>90,FORMULÁRIO!Q35-APROX!$N$3+360,0)))","v":"na"},{"$f":"IF(FORMULÁRIO!R35=0,\"na\",IF(FORMULÁRIO!R35>APROX!$Q$3,FORMULÁRIO!R35-APROX!$Q$3,IF(APROX!$Q$3-FORMULÁRIO!R35>90,FORMULÁRIO!R35-APROX!$Q$3+360,0)))","v":"na"},{"$f":"IF(FORMULÁRIO!S35=0,\"na\",IF(FORMULÁRIO!S35>APROX!$Q$3,FORMULÁRIO!S35-APROX!$Q$3,IF(APROX!$Q$3-FORMULÁRIO!S35>90,FORMULÁRIO!S35-APROX!$Q$3+360,0)))","v":"na"},{"$f":"IF(FORMULÁRIO!T35=0,\"na\",IF(FORMULÁRIO!T35>APROX!$Q$3,FORMULÁRIO!T35-APROX!$Q$3,IF(APROX!$Q$3-FORMULÁRIO!T35>90,FORMULÁRIO!T35-APROX!$Q$3+360,0)))","v":"na"}]
["esquerda",{"$f":"IF(FORMULÁRIO!C38=0,\"na\",IF(FORMULÁRIO!C38>APROX!$B$3,FORMULÁRIO!C38-APROX!$B$3,IF(APROX!$B$3-FORMULÁRIO!C38>90,FORMULÁRIO!C38-APROX!$B$3+360,0)))","v":"na"},{"$f":"IF(FORMULÁRIO!D38=0,\"na\",IF(FORMULÁRIO!D38>APROX!$B$3,FORMULÁRIO!D38-APROX!$B$3,IF(APROX!$B$3-FORMULÁRIO!D38>90,FORMULÁRIO!D38-APROX!$B$3+360,0)))","v":"na"},{"$f":"IF(FORMULÁRIO!E38=0,\"na\",IF(FORMULÁRIO!E38>APROX!$B$3,FORMULÁRIO!E38-APROX!$B$3,IF(APROX!$B$3-FORMULÁRIO!E38>90,FORMULÁRIO!E38-APROX!$B$3+360,0)))","v":"na"},{"$f":"IF(FORMULÁRIO!F38=0,\"na\",IF(FORMULÁRIO!F38>APROX!$E$3,FORMULÁRIO!F38-APROX!$E$3,IF(APROX!$E$3-FORMULÁRIO!F38>90,FORMULÁRIO!F38-APROX!$E$3+360,0)))","v":"na"},{"$f":"IF(FORMULÁRIO!G38=0,\"na\",IF(FORMULÁRIO!G38>APROX!$E$3,FORMULÁRIO!G38-APROX!$E$3,IF(APROX!$E$3-FORMULÁRIO!G38>90,FORMULÁRIO!G38-APROX!$E$3+360,0)))","v":"na"},{"$f":"IF(FORMULÁRIO!H38=0,\"na\",IF(FORMULÁRIO!H38>APROX!$E$3,FORMULÁRIO!H38-APROX!$E$3,IF(APROX!$E$3-FORMULÁRIO!H38>90,FORMULÁRIO!H38-APROX!$E$3+360,0)))","v":"na"},{"$f":"IF(FORMULÁRIO!I38=0,\"na\",IF(FORMULÁRIO!I38>APROX!$H$3,FORMULÁRIO!I38-APROX!$H$3,IF(APROX!$H$3-FORMULÁRIO!I38>90,FORMULÁRIO!I38-APROX!$H$3+360,0)))","v":"na"},{"$f":"IF(FORMULÁRIO!J38=0,\"na\",IF(FORMULÁRIO!J38>APROX!$H$3,FORMULÁRIO!J38-APROX!$H$3,IF(APROX!$H$3-FORMULÁRIO!J38>90,FORMULÁRIO!J38-APROX!$H$3+360,0)))","v":"na"},{"$f":"IF(FORMULÁRIO!K38=0,\"na\",IF(FORMULÁRIO!K38>APROX!$H$3,FORMULÁRIO!K38-APROX!$H$3,IF(APROX!$H$3-FORMULÁRIO!K38>90,FORMULÁRIO!K38-APROX!$H$3+360,0)))","v":"na"},{"$f":"IF(FORMULÁRIO!L38=0,\"na\",IF(FORMULÁRIO!L38>APROX!$K$3,FORMULÁRIO!L38-APROX!$K$3,IF(APROX!$K$3-FORMULÁRIO!L38>90,FORMULÁRIO!L38-APROX!$K$3+360,0)))","v":"na"},{"$f":"IF(FORMULÁRIO!M38=0,\"na\",IF(FORMULÁRIO!M38>APROX!$K$3,FORMULÁRIO!M38-APROX!$K$3,IF(APROX!$K$3-FORMULÁRIO!M38>90,FORMULÁRIO!M38-APROX!$K$3+360,0)))","v":"na"},{"$f":"IF(FORMULÁRIO!N38=0,\"na\",IF(FORMULÁRIO!N38>APROX!$K$3,FORMULÁRIO!N38-APROX!$K$3,IF(APROX!$K$3-FORMULÁRIO!N38>90,FORMULÁRIO!N38-APROX!$K$3+360,0)))","v":"na"},{"$f":"IF(FORMULÁRIO!O38=0,\"na\",IF(FORMULÁRIO!O38>APROX!$N$3,FORMULÁRIO!O38-APROX!$N$3,IF(APROX!$N$3-FORMULÁRIO!O38>90,FORMULÁRIO!O38-APROX!$N$3+360,0)))","v":"na"},{"$f":"IF(FORMULÁRIO!P38=0,\"na\",IF(FORMULÁRIO!P38>APROX!$N$3,FORMULÁRIO!P38-APROX!$N$3,IF(APROX!$N$3-FORMULÁRIO!P38>90,FORMULÁRIO!P38-APROX!$N$3+360,0)))","v":"na"},{"$f":"IF(FORMULÁRIO!Q38=0,\"na\",IF(FORMULÁRIO!Q38>APROX!$N$3,FORMULÁRIO!Q38-APROX!$N$3,IF(APROX!$N$3-FORMULÁRIO!Q38>90,FORMULÁRIO!Q38-APROX!$N$3+360,0)))","v":"na"},{"$f":"IF(FORMULÁRIO!R38=0,\"na\",IF(FORMULÁRIO!R38>APROX!$Q$3,FORMULÁRIO!R38-APROX!$Q$3,IF(APROX!$Q$3-FORMULÁRIO!R38>90,FORMULÁRIO!R38-APROX!$Q$3+360,0)))","v":"na"},{"$f":"IF(FORMULÁRIO!S38=0,\"na\",IF(FORMULÁRIO!S38>APROX!$Q$3,FORMULÁRIO!S38-APROX!$Q$3,IF(APROX!$Q$3-FORMULÁRIO!S38>90,FORMULÁRIO!S38-APROX!$Q$3+360,0)))","v":"na"},{"$f":"IF(FORMULÁRIO!T38=0,\"na\",IF(FORMULÁRIO!T38>APROX!$Q$3,FORMULÁRIO!T38-APROX!$Q$3,IF(APROX!$Q$3-FORMULÁRIO!T38>90,FORMULÁRIO!T38-APROX!$Q$3+360,0)))","v":"na"}]
["direita",{"$f":"IF(FORMULÁRIO!C35=0,\"na\",IF(FORMULÁRIO!C35<APROX!$B$3,IF(APROX!$B$3-FORMULÁRIO!C35>90,FORMULÁRIO!C35+360-APROX!$B$3,APROX!$B$3-FORMULÁRIO!C35),0))","v":"na"},{"$f":"IF(FORMULÁRIO!D35=0,\"na\",IF(FORMULÁRIO!D35<APROX!$B$3,IF(APROX!$B$3-FORMULÁRIO!D35>90,FORMULÁRIO!D35+360-APROX!$B$3,APROX!$B$3-FORMULÁRIO!D35),0))","v":"na"},{"$f":"IF(FORMULÁRIO!E35=0,\"na\",IF(FORMULÁRIO!E35<APROX!$B$3,IF(APROX!$B$3-FORMULÁRIO!E35>90,FORMULÁRIO!E35+360-APROX!$B$3,APROX!$B$3-FORMULÁRIO!E35),0))","v":"na"},{"$f":"IF(FORMULÁRIO!F35=0,\"na\",IF(FORMULÁRIO!F35<APROX!$E$3,IF(APROX!$E$3-FORMULÁRIO!F35>90,FORMULÁRIO!F35+360-APROX!$E$3,APROX!$E$3-FORMULÁRIO!F35),0))","v":"na"},{"$f":"IF(FORMULÁRIO!G35=0,\"na\",IF(FORMULÁRIO!G35<APROX!$E$3,IF(APROX!$E$3-FORMULÁRIO!G35>90,FORMULÁRIO!G35+360-APROX!$E$3,APROX!$E$3-FORMULÁRIO!G35),0))","v":"na"},{"$f":"IF(FORMULÁRIO!H35=0,\"na\",IF(FORMULÁRIO!H35<APROX!$E$3,IF(APROX!$E$3-FORMULÁRIO!H35>90,FORMULÁRIO!H35+360-APROX!$E$3,APROX!$E$3-FORMULÁRIO!H35),0))","v":"na"},{"$f":"IF(FORMULÁRIO!I35=0,\"na\",IF(FORMULÁRIO!I35<APROX!$H$3,IF(APROX!$H$3-FORMULÁRIO!I35>90,FORMULÁRIO!I35+360-APROX!$H$3,APROX!$H$3-FORMULÁRIO!I35),0))","v":"na"},{"$f":"IF(FORMULÁRIO!J35=0,\"na\",IF(FORMULÁRIO!J35<APROX!$H$3,IF(APROX!$H$3-FORMULÁRIO!J35>90,FORMULÁRIO!J35+360-APROX!$H$3,APROX!$H$3-FORMULÁRIO!J35),0))","v":"na"},{"$f":"IF(FORMULÁRIO!K35=0,\"na\",IF(FORMULÁRIO!K35<APROX!$H$3,IF(APROX!$H$3-FORMULÁRIO!K35>90,FORMULÁRIO!K35+360-APROX!$H$3,APROX!$H$3-FORMULÁRIO!K35),0))","v":"na"},{"$f":"IF(FORMULÁRIO!L35=0,\"na\",IF(FORMULÁRIO!L35<APROX!$K$3,IF(APROX!$K$3-FORMULÁRIO!L35>90,FORMULÁRIO!L35+360-APROX!$K$3,APROX!$K$3-FORMULÁRIO!L35),0))","v":"na"},{"$f":"IF(FORMULÁRIO!M35=0,\"na\",IF(FORMULÁRIO!M35<APROX!$K$3,IF(APROX!$K$3-FORMULÁRIO!M35>90,FORMULÁRIO!M35+360-APROX!$K$3,APROX!$K$3-FORMULÁRIO!M35),0))","v":"na"},{"$f":"IF(FORMULÁRIO!N35=0,\"na\",IF(FORMULÁRIO!N35<APROX!$K$3,IF(APROX!$K$3-FORMULÁRIO!N35>90,FORMULÁRIO!N35+360-APROX!$K$3,APROX!$K$3-FORMULÁRIO!N35),0))","v":"na"},{"$f":"IF(FORMULÁRIO!O35=0,\"na\",IF(FORMULÁRIO!O35<APROX!$N$3,IF(APROX!$N$3-FORMULÁRIO!O35>90,FORMULÁRIO!O35+360-APROX!$N$3,APROX!$N$3-FORMULÁRIO!O35),0))","v":"na"},{"$f":"IF(FORMULÁRIO!P35=0,\"na\",IF(FORMULÁRIO!P35<APROX!$N$3,IF(APROX!$N$3-FORMULÁRIO!P35>90,FORMULÁRIO!P35+360-APROX!$N$3,APROX!$N$3-FORMULÁRIO!P35),0))","v":"na"},{"$f":"IF(FORMULÁRIO!Q35=0,\"na\",IF(FORMULÁRIO!Q35<APROX!$N$3,IF(APROX!$N$3-FORMULÁRIO!Q35>90,FORMULÁRIO!Q35+360-APROX!$N$3,APROX!$N$3-FORMULÁRIO!Q35),0))","v":"na"},{"$f":"IF(FORMULÁRIO!R35=0,\"na\",IF(FORMULÁRIO!R35<APROX!$Q$3,IF(APROX!$Q$3-FORMULÁRIO!R35>90,FORMULÁRIO!R35+360-APROX!$Q$3,APROX!$Q$3-FORMULÁRIO!R35),0))","v":"na"},{"$f":"IF(FORMULÁRIO!S35=0,\"na\",IF(FORMULÁRIO!S35<APROX!$Q$3,IF(APROX!$Q$3-FORMULÁRIO!S35>90,FORMULÁRIO!S35+360-APROX!$Q$3,APROX!$Q$3-FORMULÁRIO!S35),0))","v":"na"},{"$f":"IF(FORMULÁRIO!T35=0,\"na\",IF(FORMULÁRIO!T35<APROX!$Q$3,IF(APROX!$Q$3-FORMULÁRIO!T35>90,FORMULÁRIO!T35+360-APROX!$Q$3,APROX!$Q$3-FORMULÁRIO!T35),0))","v":"na"}]
["direita",{"$f":"IF(FORMULÁRIO!C38=0,\"na\",IF(FORMULÁRIO!C38<APROX!$B$3,IF(APROX!$B$3-FORMULÁRIO!C38>90,FORMULÁRIO!C38+360-APROX!$B$3,APROX!$B$3-FORMULÁRIO!C38),0))","v":"na"},{"$f":"IF(FORMULÁRIO!D38=0,\"na\",IF(FORMULÁRIO!D38<APROX!$B$3,IF(APROX!$B$3-FORMULÁRIO!D38>90,FORMULÁRIO!D38+360-APROX!$B$3,APROX!$B$3-FORMULÁRIO!D38),0))","v":"na"},{"$f":"IF(FORMULÁRIO!E38=0,\"na\",IF(FORMULÁRIO!E38<APROX!$B$3,IF(APROX!$B$3-FORMULÁRIO!E38>90,FORMULÁRIO!E38+360-APROX!$B$3,APROX!$B$3-FORMULÁRIO!E38),0))","v":"na"},{"$f":"IF(FORMULÁRIO!F38=0,\"na\",IF(FORMULÁRIO!F38<APROX!$E$3,IF(APROX!$E$3-FORMULÁRIO!F38>90,FORMULÁRIO!F38+360-APROX!$E$3,APROX!$E$3-FORMULÁRIO!F38),0))","v":"na"},{"$f":"IF(FORMULÁRIO!G38=0,\"na\",IF(FORMULÁRIO!G38<APROX!$E$3,IF(APROX!$E$3-FORMULÁRIO!G38>90,FORMULÁRIO!G38+360-APROX!$E$3,APROX!$E$3-FORMULÁRIO!G38),0))","v":"na"},{"$f":"IF(FORMULÁRIO!H38=0,\"na\",IF(FORMULÁRIO!H38<APROX!$E$3,IF(APROX!$E$3-FORMULÁRIO!H38>90,FORMULÁRIO!H38+360-APROX!$E$3,APROX!$E$3-FORMULÁRIO!H38),0))","v":"na"},{"$f":"IF(FORMULÁRIO!I38=0,\"na\",IF(FORMULÁRIO!I38<APROX!$H$3,IF(APROX!$H$3-FORMULÁRIO!I38>90,FORMULÁRIO!I38+360-APROX!$H$3,APROX!$H$3-FORMULÁRIO!I38),0))","v":"na"},{"$f":"IF(FORMULÁRIO!J38=0,\"na\",IF(FORMULÁRIO!J38<APROX!$H$3,IF(APROX!$H$3-FORMULÁRIO!J38>90,FORMULÁRIO!J38+360-APROX!$H$3,APROX!$H$3-FORMULÁRIO!J38),0))","v":"na"},{"$f":"IF(FORMULÁRIO!K38=0,\"na\",IF(FORMULÁRIO!K38<APROX!$H$3,IF(APROX!$H$3-FORMULÁRIO!K38>90,FORMULÁRIO!K38+360-APROX!$H$3,APROX!$H$3-FORMULÁRIO!K38),0))","v":"na"},{"$f":"IF(FORMULÁRIO!L38=0,\"na\",IF(FORMULÁRIO!L38<APROX!$K$3,IF(APROX!$K$3-FORMULÁRIO!L38>90,FORMULÁRIO!L38+360-APROX!$K$3,APROX!$K$3-FORMULÁRIO!L38),0))","v":"na"},{"$f":"IF(FORMULÁRIO!M38=0,\"na\",IF(FORMULÁRIO!M38<APROX!$K$3,IF(APROX!$K$3-FORMULÁRIO!M38>90,FORMULÁRIO!M38+360-APROX!$K$3,APROX!$K$3-FORMULÁRIO!M38),0))","v":"na"},{"$f":"IF(FORMULÁRIO!N38=0,\"na\",IF(FORMULÁRIO!N38<APROX!$K$3,IF(APROX!$K$3-FORMULÁRIO!N38>90,FORMULÁRIO!N38+360-APROX!$K$3,APROX!$K$3-FORMULÁRIO!N38),0))","v":"na"},{"$f":"IF(FORMULÁRIO!O38=0,\"na\",IF(FORMULÁRIO!O38<APROX!$N$3,IF(APROX!$N$3-FORMULÁRIO!O38>90,FORMULÁRIO!O38+360-APROX!$N$3,APROX!$N$3-FORMULÁRIO!O38),0))","v":"na"},{"$f":"IF(FORMULÁRIO!P38=0,\"na\",IF(FORMULÁRIO!P38<APROX!$N$3,IF(APROX!$N$3-FORMULÁRIO!P38>90,FORMULÁRIO!P38+360-APROX!$N$3,APROX!$N$3-FORMULÁRIO!P38),0))","v":"na"},{"$f":"IF(FORMULÁRIO!Q38=0,\"na\",IF(FORMULÁRIO!Q38<APROX!$N$3,IF(APROX!$N$3-FORMULÁRIO!Q38>90,FORMULÁRIO!Q38+360-APROX!$N$3,APROX!$N$3-FORMULÁRIO!Q38),0))","v":"na"},{"$f":"IF(FORMULÁRIO!R38=0,\"na\",IF(FORMULÁRIO!R38<APROX!$Q$3,IF(APROX!$Q$3-FORMULÁRIO!R38>90,FORMULÁRIO!R38+360-APROX!$Q$3,APROX!$Q$3-FORMULÁRIO!R38),0))","v":"na"},{"$f":"IF(FORMULÁRIO!S38=0,\"na\",IF(FORMULÁRIO!S38<APROX!$Q$3,IF(APROX!$Q$3-FORMULÁRIO!S38>90,FORMULÁRIO!S38+360-APROX!$Q$3,APROX!$Q$3-FORMULÁRIO!S38),0))","v":"na"},{"$f":"IF(FORMULÁRIO!T38=0,\"na\",IF(FORMULÁRIO!T38<APROX!$Q$3,IF(APROX!$Q$3-FORMULÁRIO!T38>90,FORMULÁRIO!T38+360-APROX!$Q$3,APROX!$Q$3-FORMULÁRIO!T38),0))","v":"na"}]

{"sheet":"APROX INTERNA","index":7,"n_rows":12,"n_cols":17,"rows_kept":12,"cut":false,"hidden":true,"merged":[]}
["LETRA DO CODIGO REF DO AD É F? (S ou N)",{"$f":"FORMULÁRIO!$F$12","v":"C"},null,null,{"$f":"FORMULÁRIO!$F$12","v":"C"},null,null,{"$f":"FORMULÁRIO!$L$12","v":0},null,null,{"$f":"FORMULÁRIO!$L$12","v":0},null,null,{"$f":"FORMULÁRIO!$L$12","v":0},null,null,{"$f":"FORMULÁRIO!$L$12","v":0}]
["CABECEIRA",{"$f":"APROX!B1","v":4.0082927954098135},null,null,{"$f":"APROX!E1","v":22.008292795409815},null,null,{"$f":"APROX!H1","v":0},null,null,{"$f":"APROX!K1","v":16.117999999999999},null,null,{"$f":"APROX!N1","v":0},null,null,{"$f":"APROX!Q1","v":16.117999999999999}]
["ELEVAÇÃO DA CABECEIRA",{"$f":"APROX!B2","v":787.71},null,null,{"$f":"APROX!E2","v":786.37900000000002},null,null,{"$f":"APROX!H2","v":0},null,null,{"$f":"APROX!K2","v":0},null,null,{"$f":"APROX!N2","v":0},null,null,{"$f":"APROX!Q2","v":0}]
["CODIGO REFERENCIA APROXIMAÇÃO",{"$f":"APROX!B10","v":3},null,null,{"$f":"APROX!E10","v":3},null,null,{"$f":"APROX!H10","v":0},null,null,{"$f":"APROX!K10","v":0},null,null,{"$f":"APROX!N10","v":0},null,null,{"$f":"APROX!Q10","v":0}]
["TIPO DE OPERAÇÃO (VFR, IFR OU IFR-P)",{"$f":"APROX!B11","v":"VFR"},null,null,{"$f":"APROX!E11","v":"VFR"},null,null,{"$f":"APROX!H11","v":"IFR-P"},null,null,{"$f":"APROX!K11","v":"IFR-P"},null,null,{"$f":"APROX!N11","v":"IFR-P"},null,null,{"$f":"APROX!Q11","v":"IFR-P"}]
["Largura da borda interna (m):",{"$f":"IF(B5=\"IFR-P\",IF(B4<3,90,IF(B1=\"F\",155,120)),\"NA\")","v":"NA"},null,null,{"$f":"IF(E5=\"IFR-P\",IF(E4<3,90,IF(E1=\"F\",155,120)),\"NA\")","v":"NA"},null,null,90,null,null,90,null,null,{"$f":"IF(N5=\"IFR-P\",IF(N4<3,90,IF(N1=\"F\",155,120)),\"NA\")","v":90},null,null,{"$f":"IF(Q5=\"IFR-P\",IF(Q4<3,90,IF(Q1=\"F\",155,120)),\"NA\")","v":90}]
["Elevação da borda interna (m):",{"$f":"IF(B5=\"IFR-P\",B3,\"NA\")","v":"NA"},null,null,{"$f":"IF(E5=\"IFR-P\",E3,\"NA\")","v":"NA"},null,null,0,null,null,0,null,null,{"$f":"IF(N5=\"IFR-P\",N3,\"NA\")","v":0},null,null,{"$f":"IF(Q5=\"IFR-P\",Q3,\"NA\")","v":0}]
["Distância da cabeceira (m):",{"$f":"IF(B5=\"IFR-P\",60,\"NA\")","v":"NA"},null,null,{"$f":"IF(E5=\"IFR-P\",60,\"NA\")","v":"NA"},null,null,60,null,null,60,null,null,{"$f":"IF(N5=\"IFR-P\",60,\"NA\")","v":60},null,null,{"$f":"IF(Q5=\"IFR-P\",60,\"NA\")","v":60}]
["Abertura para cada lado (%):",{"$f":"IF(B5=\"IFR-P\",\"PARALELA\",\"NA\")","v":"NA"},null,null,{"$f":"IF(E5=\"IFR-P\",\"PARALELA\",\"NA\")","v":"NA"},null,null,"PARALELA",null,null,"PARALELA",null,null,{"$f":"IF(N5=\"IFR-P\",\"PARALELA\",\"NA\")","v":"PARALELA"},null,null,{"$f":"IF(Q5=\"IFR-P\",\"PARALELA\",\"NA\")","v":"PARALELA"}]
["Comprimento (m):",{"$f":"IF(B5=\"IFR-P\",900,\"NA\")","v":"NA"},null,null,{"$f":"IF(E5=\"IFR-P\",900,\"NA\")","v":"NA"},null,null,900,null,null,900,null,null,{"$f":"IF(N5=\"IFR-P\",900,\"NA\")","v":900},null,null,{"$f":"IF(Q5=\"IFR-P\",900,\"NA\")","v":900}]
["Gradiente (%):",{"$f":"IF(B5=\"IFR-P\",IF(B4<3,0.025,0.02),\"NA\")","v":"NA"},null,null,{"$f":"IF(E5=\"IFR-P\",IF(E4<3,0.025,0.02),\"NA\")","v":"NA"},null,null,2.5000000000000001E-2,null,null,2.5000000000000001E-2,null,null,{"$f":"IF(N5=\"IFR-P\",IF(N4<3,0.025,0.02),\"NA\")","v":2.5000000000000001E-2},null,null,{"$f":"IF(Q5=\"IFR-P\",IF(Q4<3,0.025,0.02),\"NA\")","v":2.5000000000000001E-2}]
["Elevação da borda externa (m):",{"$f":"IF(B5=\"IFR-P\",B3+B10*B11,\"NA\")","v":"NA"},null,null,{"$f":"IF(E5=\"IFR-P\",E3+E10*E11,\"NA\")","v":"NA"},null,null,22.5,null,null,22.5,null,null,{"$f":"IF(N5=\"IFR-P\",N3+N10*N11,\"NA\")","v":22.5},null,null,{"$f":"IF(Q5=\"IFR-P\",Q3+Q10*Q11,\"NA\")","v":22.5}]

{"sheet":"TRANSIÇÃO INTERNA","index":8,"n_rows":7,"n_cols":17,"rows_kept":7,"cut":false,"hidden":true,"merged":[]}
["LETRA DO CODIGO REF DO AD É F? (S ou N)",{"$f":"'APROX INTERNA'!B1","v":"C"},null,null,{"$f":"'APROX INTERNA'!E1","v":"C"},null,null,{"$f":"'APROX INTERNA'!H1","v":0},null,null,{"$f":"'APROX INTERNA'!K1","v":0},null,null,{"$f":"'APROX INTERNA'!N1","v":0},null,null,{"$f":"'APROX INTERNA'!Q1","v":0}]
["CABECEIRA",{"$f":"'APROX INTERNA'!B2","v":4.0082927954098135},null,null,{"$f":"'APROX INTERNA'!E2","v":22.008292795409815},null,null,{"$f":"'APROX INTERNA'!H2","v":0},null,null,{"$f":"'APROX INTERNA'!K2","v":16.117999999999999},null,null,{"$f":"'APROX INTERNA'!N2","v":0},null,null,{"$f":"'APROX INTERNA'!Q2","v":16.117999999999999}]
["ELEVAÇÃO DA CABECEIRA",{"$f":"'APROX INTERNA'!B3","v":787.71},null,null,{"$f":"'APROX INTERNA'!E3","v":786.37900000000002},null,null,{"$f":"'APROX INTERNA'!H3","v":0},null,null,{"$f":"'APROX INTERNA'!K3","v":0},null,null,{"$f":"'APROX INTERNA'!N3","v":0},null,null,{"$f":"'APROX INTERNA'!Q3","v":0}]
["CODIGO REFERENCIA APROXIMAÇÃO",{"$f":"'APROX INTERNA'!B4","v":3},null,null,{"$f":"'APROX INTERNA'!E4","v":3},null,null,{"$f":"'APROX INTERNA'!H4","v":0},null,null,{"$f":"'APROX INTERNA'!K4","v":0},null,null,{"$f":"'APROX INTERNA'!N4","v":0},null,null,{"$f":"'APROX INTERNA'!Q4","v":0}]
["TIPO DE OPERAÇÃO (VFR, IFR OU IFR-P)",{"$f":"'APROX INTERNA'!B5","v":"VFR"},null,null,{"$f":"'APROX INTERNA'!E5","v":"VFR"},null,null,{"$f":"'APROX INTERNA'!H5","v":"IFR-P"},null,null,{"$f":"'APROX INTERNA'!K5","v":"IFR-P"},null,null,{"$f":"'APROX INTERNA'!N5","v":"IFR-P"},null,null,{"$f":"'APROX INTERNA'!Q5","v":"IFR-P"}]
["Gradiente (%):",{"$f":"IF(B5=\"IFR-P\",IF(B4<3,0.4,0.333),\"NA\")","v":"NA"},null,null,{"$f":"IF(E5=\"IFR-P\",IF(E4<3,0.4,0.333),\"NA\")","v":"NA"},null,null,{"$f":"IF(H5=\"IFR-P\",IF(H4<3,0.4,0.333),\"NA\")","v":0.4},null,null,{"$f":"IF(K5=\"IFR-P\",IF(K4<3,0.4,0.333),\"NA\")","v":0.4},null,null,{"$f":"IF(N5=\"IFR-P\",IF(N4<3,0.4,0.333),\"NA\")","v":0.4},null,null,{"$f":"IF(Q5=\"IFR-P\",IF(Q4<3,0.4,0.333),\"NA\")","v":0.4}]
["Elevação da borda superior (m):",{"$f":"IF(B5=\"IFR-P\",45+FORMULÁRIO!$C$7,\"NA\")","v":"NA"},null,null,{"$f":"IF(E5=\"IFR-P\",45+FORMULÁRIO!$C$7,\"NA\")","v":"NA"},null,null,{"$f":"IF(H5=\"IFR-P\",45+FORMULÁRIO!$C$7,\"NA\")","v":832.71},null,null,{"$f":"IF(K5=\"IFR-P\",45+FORMULÁRIO!$C$7,\"NA\")","v":832.71},null,null,{"$f":"IF(N5=\"IFR-P\",45+FORMULÁRIO!$C$7,\"NA\")","v":832.71},null,null,{"$f":"IF(Q5=\"IFR-P\",45+FORMULÁRIO!$C$7,\"NA\")","v":832.71}]

{"sheet":"POUSO INTERROMPIDO","index":9,"n_rows":12,"n_cols":17,"rows_kept":12,"cut":false,"hidden":true,"merged":[]}
["LETRA DO CODIGO REF ",{"$f":"'APROX INTERNA'!B1","v":"C"},null,null,{"$f":"'APROX INTERNA'!E1","v":"C"},null,null,{"$f":"'APROX INTERNA'!H1","v":0},null,null,{"$f":"'APROX INTERNA'!K1","v":0},null,null,{"$f":"'APROX INTERNA'!N1","v":0},null,null,{"$f":"'APROX INTERNA'!Q1","v":0}]
["CABECEIRA",{"$f":"'APROX INTERNA'!B2","v":4.0082927954098135},null,null,{"$f":"'APROX INTERNA'!E2","v":22.008292795409815},null,null,{"$f":"'APROX INTERNA'!H2","v":0},null,null,{"$f":"'APROX INTERNA'!K2","v":16.117999999999999},null,null,{"$f":"'APROX INTERNA'!N2","v":0},null,null,{"$f":"'APROX INTERNA'!Q2","v":16.117999999999999}]
["ELEVAÇÃO DA CABECEIRA",{"$f":"'APROX INTERNA'!B3","v":787.71},null,null,{"$f":"'APROX INTERNA'!E3","v":786.37900000000002},null,null,{"$f":"'APROX INTERNA'!H3","v":0},null,null,{"$f":"'APROX INTERNA'!K3","v":0},null,null,{"$f":"'APROX INTERNA'!N3","v":0},null,null,{"$f":"'APROX INTERNA'!Q3","v":0}]
["CODIGO REFERENCIA APROXIMAÇÃO",{"$f":"FORMULÁRIO!C26","v":3},null,null,{"$f":"FORMULÁRIO!F26","v":3},null,null,{"$f":"FORMULÁRIO!I26","v":0},null,null,{"$f":"FORMULÁRIO!L26","v":0},null,null,{"$f":"FORMULÁRIO!O26","v":0},null,null,{"$f":"FORMULÁRIO!R26","v":0}]
["TIPO DE OPERAÇÃO (VFR, IFR OU IFR-P)",{"$f":"'APROX INTERNA'!B5","v":"VFR"},null,null,{"$f":"'APROX INTERNA'!E5","v":"VFR"},null,null,{"$f":"'APROX INTERNA'!H5","v":"IFR-P"},null,null,{"$f":"'APROX INTERNA'!K5","v":"IFR-P"},null,null,{"$f":"'APROX INTERNA'!N5","v":"IFR-P"},null,null,{"$f":"'APROX INTERNA'!Q5","v":"IFR-P"}]
["Elevação da borda interna (m):",{"$f":"FORMULÁRIO!E28","v":0},null,null,{"$f":"FORMULÁRIO!H28","v":0},null,null,{"$f":"FORMULÁRIO!K28","v":0},null,null,{"$f":"FORMULÁRIO!N28","v":0},null,null,{"$f":"FORMULÁRIO!Q28","v":0},null,null,{"$f":"FORMULÁRIO!T28","v":0}]
["Largura da borda interna (m):",{"$f":"IF(B5=\"IFR-P\",IF(B4<3,90,IF(B2=\"S\",155,120)),\"NA\")","v":"NA"},null,null,{"$f":"IF(E5=\"IFR-P\",IF(E4<3,90,IF(E2=\"S\",155,120)),\"NA\")","v":"NA"},null,null,{"$f":"IF(H5=\"IFR-P\",IF(H4<3,90,IF(H2=\"S\",155,120)),\"NA\")","v":90},null,null,{"$f":"IF(K5=\"IFR-P\",IF(K4<3,90,IF(K2=\"S\",155,120)),\"NA\")","v":90},null,null,{"$f":"IF(N5=\"IFR-P\",IF(N4<3,90,IF(N2=\"S\",155,120)),\"NA\")","v":90},null,null,{"$f":"IF(Q5=\"IFR-P\",IF(Q4<3,90,IF(Q2=\"S\",155,120)),\"NA\")","v":90}]
["Elevação da borda interna (m):",{"$f":"IF(B5=\"IFR-P\",B6,\"NA\")","v":"NA"},null,null,{"$f":"IF(E5=\"IFR-P\",E6,\"NA\")","v":"NA"},null,null,0,null,null,0,null,null,{"$f":"IF(N5=\"IFR-P\",N6,\"NA\")","v":0},null,null,{"$f":"IF(Q5=\"IFR-P\",Q6,\"NA\")","v":0}]
["Distância da cabeceira (m):",{"$f":"IF(B5=\"IFR-P\",IF(B4<3,FORMULÁRIO!$C$17+APROX!B18,IF(FORMULÁRIO!$C$13<1800,FORMULÁRIO!$C$13,1800)),\"NA\")","v":"NA"},{"$f":"IF(C5=\"IFR-P\",IF(C4<3,FORMULÁRIO!$C$17+APROX!C18,IF(FORMULÁRIO!$C$13<1800,FORMULÁRIO!$C$13,1800)),\"NA\")","v":"NA"},{"$f":"IF(D5=\"IFR-P\",IF(D4<3,FORMULÁRIO!$C$17+APROX!D18,IF(FORMULÁRIO!$C$13<1800,FORMULÁRIO!$C$13,1800)),\"NA\")","v":"NA"},{"$f":"IF(E5=\"IFR-P\",IF(E4<3,FORMULÁRIO!$C$17+APROX!E18,IF(FORMULÁRIO!$C$13<1800,FORMULÁRIO!$C$13,1800)),\"NA\")","v":"NA"},null,null,{"$f":"IF(H5=\"IFR-P\",IF(H4<3,FORMULÁRIO!$I$17+APROX!H18,IF(FORMULÁRIO!$I$13<1800,FORMULÁRIO!$I$13,1800)),\"NA\")","v":180.1},null,null,{"$f":"IF(K5=\"IFR-P\",IF(K4<3,FORMULÁRIO!$I$17+APROX!K18,IF(FORMULÁRIO!$I$13<1800,FORMULÁRIO!$I$13,1800)),\"NA\")","v":180.1},null,null,{"$f":"IF(N5=\"IFR-P\",IF(N4<3,FORMULÁRIO!$O$17+APROX!N18,IF(FORMULÁRIO!$O$13<1800,FORMULÁRIO!$O$13,1800)),\"NA\")","v":180.1},null,null,{"$f":"IF(Q5=\"IFR-P\",IF(Q4<3,FORMULÁRIO!$O$17+APROX!Q18,IF(FORMULÁRIO!$O$13<1800,FORMULÁRIO!$O$13,1800)),\"NA\")","v":180.1}]
["Abertura para cada lado (%):",{"$f":"IF(B5=\"IFR-P\",0.1,\"NA\")","v":"NA"},null,null,{"$f":"IF(E5=\"IFR-P\",0.1,\"NA\")","v":"NA"},null,null,{"$f":"IF(H5=\"IFR-P\",0.1,\"NA\")","v":0.1},null,null,{"$f":"IF(K5=\"IFR-P\",0.1,\"NA\")","v":0.1},null,null,{"$f":"IF(N5=\"IFR-P\",0.1,\"NA\")","v":0.1},null,null,{"$f":"IF(Q5=\"IFR-P\",0.1,\"NA\")","v":0.1}]
["Gradiente (%):",{"$f":"IF(B5=\"IFR-P\",IF(B4<3,0.04,0.0333),\"NA\")","v":"NA"},null,null,{"$f":"IF(E5=\"IFR-P\",IF(E4<3,0.04,0.0333),\"NA\")","v":"NA"},null,null,{"$f":"IF(H5=\"IFR-P\",IF(H4<3,0.04,0.0333),\"NA\")","v":0.04},null,null,{"$f":"IF(K5=\"IFR-P\",IF(K4<3,0.04,0.0333),\"NA\")","v":0.04},null,null,{"$f":"IF(N5=\"IFR-P\",IF(N4<3,0.04,0.0333),\"NA\")","v":0.04},null,null,{"$f":"IF(Q5=\"IFR-P\",IF(Q4<3,0.04,0.0333),\"NA\")","v":0.04}]
["Elevação da borda externa (m):",{"$f":"IF(B5=\"IFR-P\",FORMULÁRIO!$C$7+45,\"NA\")","v":"NA"},null,null,{"$f":"IF(E5=\"IFR-P\",FORMULÁRIO!$C$7+45,\"NA\")","v":"NA"},null,null,{"$f":"IF(H5=\"IFR-P\",FORMULÁRIO!$C$7+45,\"NA\")","v":832.71},null,null,{"$f":"IF(K5=\"IFR-P\",FORMULÁRIO!$C$7+45,\"NA\")","v":832.71},null,null,{"$f":"IF(N5=\"IFR-P\",FORMULÁRIO!$C$7+45,\"NA\")","v":832.71},null,null,{"$f":"IF(Q5=\"IFR-P\",FORMULÁRIO!$C$7+45,\"NA\")","v":832.71}]

{"sheet":"TRANSIÇÃO","index":10,"n_rows":10,"n_cols":4,"rows_kept":10,"cut":false,"hidden":true,"merged":[]}
["CODIGO DE REFERÊNCIA",{"$f":"MAX(FORMULÁRIO!C26:H26)","v":3},{"$f":"MAX(FORMULÁRIO!I26:N26)","v":0},{"$f":"MAX(FORMULÁRIO!O26:T26)","v":0}]
["TIPO DE OPERAÇÃO (VFR, IFR OU IFR-P)",{"$f":"IF(B10<10,\"VFR\",IF(B16<100,\"IFR\",\"IFR-P\"))","v":"VFR"},{"$f":"IF(C10<10,\"VFR\",IF(C16<100,\"IFR\",\"IFR-P\"))","v":"IFR"},{"$f":"IF(D10<10,\"VFR\",IF(D16<100,\"IFR\",\"IFR-P\"))","v":"IFR"}]
[]
[]
["Gradiente (%):",{"$f":"IF(B2=\"IFR-P\",0.143,IF(B1>2,0.143,0.2))","v":0.14299999999999999},{"$f":"IF(C2=\"IFR-P\",0.143,IF(C1>2,0.143,0.2))","v":0.2},{"$f":"IF(D2=\"IFR-P\",0.143,IF(D1>2,0.143,0.2))","v":0.2}]
[]
[]
[null,{"$f":"IF(FORMULÁRIO!C27=\"vfr\",1,IF(FORMULÁRIO!C27=\"ifr npa\",10,IF(FORMULÁRIO!C27=\"não aplicável\",0,1000)))","v":1},{"$f":"IF(FORMULÁRIO!I27=\"vfr\",1,IF(FORMULÁRIO!I27=\"ifr npa\",10,IF(FORMULÁRIO!I27=\"não aplicável\",0,1000)))","v":1000},{"$f":"IF(FORMULÁRIO!O27=\"vfr\",1,IF(FORMULÁRIO!O27=\"ifr npa\",10,IF(FORMULÁRIO!O27=\"não aplicável\",0,1000)))","v":1000}]
[null,{"$f":"IF(FORMULÁRIO!F27=\"vfr\",1,IF(FORMULÁRIO!F27=\"ifr npa\",10,IF(FORMULÁRIO!F27=\"não aplicável\",0,1000)))","v":1},{"$f":"IF(FORMULÁRIO!L27=\"vfr\",1,IF(FORMULÁRIO!L27=\"ifr npa\",10,IF(FORMULÁRIO!L27=\"não aplicável\",0,1000)))","v":1000},{"$f":"IF(FORMULÁRIO!R27=\"vfr\",1,IF(FORMULÁRIO!R27=\"ifr npa\",10,IF(FORMULÁRIO!R27=\"não aplicável\",0,1000)))","v":1000}]
[null,{"$f":"SUM(B8:B9)","v":2},{"$f":"SUM(C8:C9)","v":2000},{"$f":"SUM(D8:D9)","v":2000}]

{"sheet":"HORIZONTAL INTERNA","index":11,"n_rows":7,"n_cols":4,"rows_kept":7,"cut":false,"hidden":true,"merged":[]}
["CODIGO DE REFERÊNCIA",{"$f":"PISTA!B1","v":3},{"$f":"PISTA!C1","v":0},{"$f":"PISTA!D1","v":0}]
["TIPO DE OPERAÇÃO (VFR, IFR OU IFR-P)",{"$f":"PISTA!B2","v":"VFR"},{"$f":"PISTA!C2","v":"IFR-P"},{"$f":"PISTA!D2","v":"IFR-P"}]
[]
["Altitude (m):",{"$f":"B7+45","v":832.71},{"$f":"C7+45","v":832.71},{"$f":"D7+45","v":832.71}]
["Raio (m)",{"$f":"IF(B1>2,4000,IF(B2=\"VFR\",IF(B1=1,2000,2500),3500))","v":4000},{"$f":"IF(C1>2,4000,IF(C2=\"VFR\",IF(C1=1,2000,2500),3500))","v":3500},{"$f":"IF(D1>2,4000,IF(D2=\"VFR\",IF(D1=1,2000,2500),3500))","v":3500}]
[]
["altitude",{"$f":"IF(FORMULÁRIO!C7-FORMULÁRIO!C15>5.99,FORMULÁRIO!C15,FORMULÁRIO!C7)","v":787.71},{"$f":"IF(AND(FORMULÁRIO!C7-FORMULÁRIO!I15>5.99,FORMULÁRIO!I15>0),FORMULÁRIO!I15,FORMULÁRIO!C7)","v":787.71},{"$f":"IF(AND(FORMULÁRIO!C7-FORMULÁRIO!O15>5.99,FORMULÁRIO!O15>0),FORMULÁRIO!O15,FORMULÁRIO!C7)","v":787.71}]

{"sheet":"CÔNICA","index":12,"n_rows":5,"n_cols":4,"rows_kept":5,"cut":false,"hidden":true,"merged":[]}
["CODIGO DE REFERÊNCIA",{"$f":"'HORIZONTAL INTERNA'!B1","v":3},{"$f":"'HORIZONTAL INTERNA'!C1","v":0},{"$f":"'HORIZONTAL INTERNA'!D1","v":0}]
["TIPO DE OPERAÇÃO (VFR, IFR OU IFR-P)",{"$f":"'HORIZONTAL INTERNA'!B2","v":"VFR"},{"$f":"'HORIZONTAL INTERNA'!C2","v":"IFR-P"},{"$f":"'HORIZONTAL INTERNA'!D2","v":"IFR-P"}]
[]
["Altitude (m):",{"$f":"IF(B1=4,100,IF(B1=3,IF(B2=\"IFR-P\",100,75),IF(B1=2,IF(B2=\"VFR\",55,60),IF(B1=1,IF(B2=\"VFR\",35,60)))))+'HORIZONTAL INTERNA'!B4","v":907.71},{"$f":"IF(C1=4,100,IF(C1=3,IF(C2=\"IFR-P\",100,75),IF(C1=2,IF(C2=\"VFR\",55,60),IF(C1=1,IF(C2=\"VFR\",35,60)))))+'HORIZONTAL INTERNA'!C4","v":832.71},{"$f":"IF(D1=4,100,IF(D1=3,IF(D2=\"IFR-P\",100,75),IF(D1=2,IF(D2=\"VFR\",55,60),IF(D1=1,IF(D2=\"VFR\",35,60)))))+'HORIZONTAL INTERNA'!D4","v":832.71}]
["Raio (m)",0.05,0.05,0.05]

{"sheet":"SPVV","index":13,"n_rows":20,"n_cols":21,"rows_kept":20,"cut":false,"hidden":true,"merged":[]}
["Largura (m):",{"$f":"IF(FORMULÁRIO!C$113=\"aplicável\",2350,\"NA\")","v":2350},{"$f":"IF(FORMULÁRIO!D$113=\"aplicável\",2350,\"NA\")","v":"NA"},{"$f":"IF(FORMULÁRIO!E$113=\"aplicável\",2350,\"NA\")","v":"NA"},{"$f":"IF(FORMULÁRIO!F$113=\"aplicável\",2350,\"NA\")","v":"NA"},{"$f":"IF(FORMULÁRIO!G$113=\"aplicável\",2350,\"NA\")","v":"NA"},{"$f":"IF(FORMULÁRIO!H$113=\"aplicável\",2350,\"NA\")","v":"NA"},{"$f":"IF(FORMULÁRIO!I$113=\"aplicável\",2350,\"NA\")","v":"NA"},{"$f":"IF(FORMULÁRIO!J$113=\"aplicável\",2350,\"NA\")","v":"NA"},{"$f":"IF(FORMULÁRIO!K$113=\"aplicável\",2350,\"NA\")","v":"NA"},{"$f":"IF(FORMULÁRIO!L$113=\"aplicável\",2350,\"NA\")","v":"NA"},{"$f":"IF(FORMULÁRIO!M$113=\"aplicável\",2350,\"NA\")","v":"NA"},{"$f":"IF(FORMULÁRIO!N$113=\"aplicável\",2350,\"NA\")","v":"NA"},{"$f":"IF(FORMULÁRIO!O$113=\"aplicável\",2350,\"NA\")","v":"NA"},{"$f":"IF(FORMULÁRIO!P$113=\"aplicável\",2350,\"NA\")","v":"NA"},{"$f":"IF(FORMULÁRIO!Q$113=\"aplicável\",2350,\"NA\")","v":"NA"},{"$f":"IF(FORMULÁRIO!R$113=\"aplicável\",2350,\"NA\")","v":"NA"},{"$f":"IF(FORMULÁRIO!S$113=\"aplicável\",2350,\"NA\")","v":"NA"},{"$f":"IF(FORMULÁRIO!T$113=\"aplicável\",2350,\"NA\")","v":"NA"},{"$f":"IF(FORMULÁRIO!U$113=\"aplicável\",2350,\"NA\")","v":"NA"},{"$f":"IF(FORMULÁRIO!V$113=\"aplicável\",2350,\"NA\")","v":"NA"}]
["Buffer (m):",{"$f":"IF(FORMULÁRIO!C$113=\"aplicável\",470,\"NA\")","v":470},{"$f":"IF(FORMULÁRIO!D$113=\"aplicável\",470,\"NA\")","v":"NA"},{"$f":"IF(FORMULÁRIO!E$113=\"aplicável\",470,\"NA\")","v":"NA"},{"$f":"IF(FORMULÁRIO!F$113=\"aplicável\",470,\"NA\")","v":"NA"},{"$f":"IF(FORMULÁRIO!G$113=\"aplicável\",470,\"NA\")","v":"NA"},{"$f":"IF(FORMULÁRIO!H$113=\"aplicável\",470,\"NA\")","v":"NA"},{"$f":"IF(FORMULÁRIO!I$113=\"aplicável\",470,\"NA\")","v":"NA"},{"$f":"IF(FORMULÁRIO!J$113=\"aplicável\",470,\"NA\")","v":"NA"},{"$f":"IF(FORMULÁRIO!K$113=\"aplicável\",470,\"NA\")","v":"NA"},{"$f":"IF(FORMULÁRIO!L$113=\"aplicável\",470,\"NA\")","v":"NA"},{"$f":"IF(FORMULÁRIO!M$113=\"aplicável\",470,\"NA\")","v":"NA"},{"$f":"IF(FORMULÁRIO!N$113=\"aplicável\",470,\"NA\")","v":"NA"},{"$f":"IF(FORMULÁRIO!O$113=\"aplicável\",470,\"NA\")","v":"NA"},{"$f":"IF(FORMULÁRIO!P$113=\"aplicável\",470,\"NA\")","v":"NA"},{"$f":"IF(FORMULÁRIO!Q$113=\"aplicável\",470,\"NA\")","v":"NA"},{"$f":"IF(FORMULÁRIO!R$113=\"aplicável\",470,\"NA\")","v":"NA"},{"$f":"IF(FORMULÁRIO!S$113=\"aplicável\",470,\"NA\")","v":"NA"},{"$f":"IF(FORMULÁRIO!T$113=\"aplicável\",470,\"NA\")","v":"NA"},{"$f":"IF(FORMULÁRIO!U$113=\"aplicável\",470,\"NA\")","v":"NA"},{"$f":"IF(FORMULÁRIO!V$113=\"aplicável\",470,\"NA\")","v":"NA"}]
["Comprimento (m):",{"$f":"IF(FORMULÁRIO!C$113=\"aplicável\",2350,\"NA\")","v":2350},{"$f":"IF(FORMULÁRIO!D$113=\"aplicável\",2350,\"NA\")","v":"NA"},{"$f":"IF(FORMULÁRIO!E$113=\"aplicável\",2350,\"NA\")","v":"NA"},{"$f":"IF(FORMULÁRIO!F$113=\"aplicável\",2350,\"NA\")","v":"NA"},{"$f":"IF(FORMULÁRIO!G$113=\"aplicável\",2350,\"NA\")","v":"NA"},{"$f":"IF(FORMULÁRIO!H$113=\"aplicável\",2350,\"NA\")","v":"NA"},{"$f":"IF(FORMULÁRIO!I$113=\"aplicável\",2350,\"NA\")","v":"NA"},{"$f":"IF(FORMULÁRIO!J$113=\"aplicável\",2350,\"NA\")","v":"NA"},{"$f":"IF(FORMULÁRIO!K$113=\"aplicável\",2350,\"NA\")","v":"NA"},{"$f":"IF(FORMULÁRIO!L$113=\"aplicável\",2350,\"NA\")","v":"NA"},{"$f":"IF(FORMULÁRIO!M$113=\"aplicável\",2350,\"NA\")","v":"NA"},{"$f":"IF(FORMULÁRIO!N$113=\"aplicável\",2350,\"NA\")","v":"NA"},{"$f":"IF(FORMULÁRIO!O$113=\"aplicável\",2350,\"NA\")","v":"NA"},{"$f":"IF(FORMULÁRIO!P$113=\"aplicável\",2350,\"NA\")","v":"NA"},{"$f":"IF(FORMULÁRIO!Q$113=\"aplicável\",2350,\"NA\")","v":"NA"},{"$f":"IF(FORMULÁRIO!R$113=\"aplicável\",2350,\"NA\")","v":"NA"},{"$f":"IF(FORMULÁRIO!S$113=\"aplicável\",2350,\"NA\")","v":"NA"},{"$f":"IF(FORMULÁRIO!T$113=\"aplicável\",2350,\"NA\")","v":"NA"},{"$f":"IF(FORMULÁRIO!U$113=\"aplicável\",2350,\"NA\")","v":"NA"},{"$f":"IF(FORMULÁRIO!V$113=\"aplicável\",2350,\"NA\")","v":"NA"}]
[]
["Altitude seção de través (m):",{"$f":"IF(FORMULÁRIO!$C$113=\"aplicável\",FORMULÁRIO!C122+FORMULÁRIO!$C$7-(250/3.2808),\"NA\")","v":863.50907339673256},null,null,{"$f":"IF(FORMULÁRIO!$C$113=\"aplicável\",FORMULÁRIO!F122+FORMULÁRIO!$C$7-(250/3.2808),\"NA\")","v":863.50907339673256},null,null,{"$f":"IF(FORMULÁRIO!$I$113=\"aplicável\",FORMULÁRIO!I122+FORMULÁRIO!$C$7-(250/3.2808),\"NA\")","v":"NA"},null,null,{"$f":"IF(FORMULÁRIO!$I$113=\"aplicável\",FORMULÁRIO!L122+FORMULÁRIO!$C$7-(250/3.2808),\"NA\")","v":"NA"},null,null,{"$f":"IF(FORMULÁRIO!$O$113=\"aplicável\",FORMULÁRIO!O122+FORMULÁRIO!$C$7-(250/3.2808),\"NA\")","v":"NA"},null,null,{"$f":"IF(FORMULÁRIO!$O$113=\"aplicável\",FORMULÁRIO!R122+FORMULÁRIO!$C$7-(250/3.2808),\"NA\")","v":"NA"}]
["Altitude seção de aprox/dep (m):",{"$f":"IF(FORMULÁRIO!$C$113=\"aplicável\",FORMULÁRIO!C122+FORMULÁRIO!$C$7-(325/3.2808),\"NA\")","v":840.64879541575226},null,null,{"$f":"IF(FORMULÁRIO!$C$113=\"aplicável\",FORMULÁRIO!F122+FORMULÁRIO!$C$7-(325/3.2808),\"NA\")","v":840.64879541575226},null,null,{"$f":"IF(FORMULÁRIO!$I$113=\"aplicável\",FORMULÁRIO!I122+FORMULÁRIO!$C$7-(325/3.2808),\"NA\")","v":"NA"},null,null,{"$f":"IF(FORMULÁRIO!$I$113=\"aplicável\",FORMULÁRIO!L122+FORMULÁRIO!$C$7-(325/3.2808),\"NA\")","v":"NA"},null,null,{"$f":"IF(FORMULÁRIO!$O$113=\"aplicável\",FORMULÁRIO!O122+FORMULÁRIO!$C$7-(325/3.2808),\"NA\")","v":"NA"},null,null,{"$f":"IF(FORMULÁRIO!$O$113=\"aplicável\",FORMULÁRIO!R122+FORMULÁRIO!$C$7-(325/3.2808),\"NA\")","v":"NA"}]
["MARCAÇÃO"]
[]
[]
["Largura (m):",{"$f":"IF(FORMULÁRIO!$C$124=\"aplicável\",IF(FORMULÁRIO!$C$125=\"A\",2350,(IF(FORMULÁRIO!$C$125=\"B\",2780,4170))),\"NA\")","v":4170},null,null,null,null,null,{"$f":"IF(FORMULÁRIO!$I$124=\"aplicável\",IF(FORMULÁRIO!$I$125=\"A\",2350,(IF(FORMULÁRIO!$I$125=\"B\",2780,4170))),\"NA\")","v":"NA"},null,null,null,null,null,{"$f":"IF(FORMULÁRIO!$O$124=\"aplicável\",IF(FORMULÁRIO!$O$125=\"A\",2350,(IF(FORMULÁRIO!$O$125=\"B\",2780,4170))),\"NA\")","v":"NA"}]
["Buffer (m):",{"$f":"IF(FORMULÁRIO!$C$124=\"aplicável\",IF(FORMULÁRIO!$C$125=\"A\",470,(IF(FORMULÁRIO!$C$125=\"B\",470,930))),\"NA\")","v":930},null,null,null,null,null,{"$f":"IF(FORMULÁRIO!$I$124=\"aplicável\",IF(FORMULÁRIO!$I$125=\"A\",470,(IF(FORMULÁRIO!$I$125=\"B\",470,930))),\"NA\")","v":"NA"},null,null,null,null,null,{"$f":"IF(FORMULÁRIO!$O$124=\"aplicável\",IF(FORMULÁRIO!$O$125=\"A\",470,(IF(FORMULÁRIO!$O$125=\"B\",470,930))),\"NA\")","v":"NA"}]
["Comprimento (m):",{"$f":"IF(FORMULÁRIO!$C$124=\"aplicável\",IF(FORMULÁRIO!$C$125=\"A\",2350,(IF(FORMULÁRIO!$C$125=\"B\",2780,4170))),\"NA\")","v":4170},null,null,null,null,null,{"$f":"IF(FORMULÁRIO!$I$124=\"aplicável\",IF(FORMULÁRIO!$I$125=\"A\",2350,(IF(FORMULÁRIO!$I$125=\"B\",2780,4170))),\"NA\")","v":"NA"},null,null,null,null,null,{"$f":"IF(FORMULÁRIO!$O$124=\"aplicável\",IF(FORMULÁRIO!$O$125=\"A\",2350,(IF(FORMULÁRIO!$O$125=\"B\",2780,4170))),\"NA\")","v":"NA"}]
[]
["Altitude seção de través (m):",{"$f":"IF(FORMULÁRIO!$C$124=\"aplicável\",FORMULÁRIO!C134+FORMULÁRIO!$C$7-(500/3.2808),\"NA\")","v":940.30814679346508},null,null,{"$f":"IF(FORMULÁRIO!$C$124=\"aplicável\",FORMULÁRIO!F134+FORMULÁRIO!$C$7-(500/3.2808),\"NA\")","v":940.30814679346508},null,null,{"$f":"IF(FORMULÁRIO!$I$124=\"aplicável\",FORMULÁRIO!I134+FORMULÁRIO!$C$7-(500/3.2808),\"NA\")","v":"NA"},null,null,{"$f":"IF(FORMULÁRIO!$I$124=\"aplicável\",FORMULÁRIO!L134+FORMULÁRIO!$C$7-(500/3.2808),\"NA\")","v":"NA"},null,null,{"$f":"IF(FORMULÁRIO!$O$124=\"aplicável\",FORMULÁRIO!O134+FORMULÁRIO!$C$7-(500/3.2808),\"NA\")","v":"NA"},null,null,{"$f":"IF(FORMULÁRIO!$O$124=\"aplicável\",FORMULÁRIO!R134+FORMULÁRIO!$C$7-(500/3.2808),\"NA\")","v":"NA"}]
["Altitude seção de aprox/dep (m):",{"$f":"IF(FORMULÁRIO!$C$124=\"aplicável\",FORMULÁRIO!C134+FORMULÁRIO!$C$7-(650/3.2808),\"NA\")","v":894.5875908315046},null,null,{"$f":"IF(FORMULÁRIO!$C$124=\"aplicável\",FORMULÁRIO!F134+FORMULÁRIO!$C$7-(650/3.2808),\"NA\")","v":894.5875908315046},null,null,{"$f":"IF(FORMULÁRIO!$I$124=\"aplicável\",FORMULÁRIO!I134+FORMULÁRIO!$C$7-(650/3.2808),\"NA\")","v":"NA"},null,null,{"$f":"IF(FORMULÁRIO!$I$124=\"aplicável\",FORMULÁRIO!L134+FORMULÁRIO!$C$7-(650/3.2808),\"NA\")","v":"NA"},null,null,{"$f":"IF(FORMULÁRIO!$O$124=\"aplicável\",FORMULÁRIO!O134+FORMULÁRIO!$C$7-(650/3.2808),\"NA\")","v":"NA"},null,null,{"$f":"IF(FORMULÁRIO!$O$124=\"aplicável\",FORMULÁRIO!R134+FORMULÁRIO!$C$7-(650/3.2808),\"NA\")","v":"NA"}]
["Largura (m):",{"$f":"IF(FORMULÁRIO!C136=\"aplicável\",7410,\"NA\")","v":"NA"},null,null,null,null,null,{"$f":"IF(FORMULÁRIO!I136=\"aplicável\",7410,\"NA\")","v":"NA"},null,null,null,null,null,{"$f":"IF(FORMULÁRIO!O136=\"aplicável\",7410,\"NA\")","v":"NA"}]
["Buffer (m):",{"$f":"IF(FORMULÁRIO!C136=\"aplicável\",930,\"NA\")","v":"NA"},null,null,null,null,null,{"$f":"IF(FORMULÁRIO!I136=\"aplicável\",930,\"NA\")","v":"NA"},null,null,null,null,null,{"$f":"IF(FORMULÁRIO!O136=\"aplicável\",930,\"NA\")","v":"NA"}]
["Comprimento (m):",{"$f":"IF(FORMULÁRIO!C136=\"aplicável\",5560,\"NA\")","v":"NA"},null,null,null,null,null,{"$f":"IF(FORMULÁRIO!I136=\"aplicável\",5560,\"NA\")","v":"NA"},null,null,null,null,null,{"$f":"IF(FORMULÁRIO!O136=\"aplicável\",5560,\"NA\")","v":"NA"}]
["Altitude seção través (m):",{"$f":"IF(FORMULÁRIO!C136=\"aplicável\",FORMULÁRIO!$C$7+(1000/3.2808),\"NA\")","v":"NA"},null,null,null,null,null,{"$f":"IF(FORMULÁRIO!I136=\"aplicável\",FORMULÁRIO!$C$7+(1000/3.2808),\"NA\")","v":"NA"},null,null,null,null,null,{"$f":"IF(FORMULÁRIO!O136=\"aplicável\",FORMULÁRIO!$C$7+(1000/3.2808),\"NA\")","v":"NA"}]
["Altitude seção aprox/dep (m):",{"$f":"IF(FORMULÁRIO!C136=\"aplicável\",FORMULÁRIO!$C$7+(850/3.2808),\"NA\")","v":"NA"},null,null,null,null,null,{"$f":"IF(FORMULÁRIO!I136=\"aplicável\",FORMULÁRIO!$C$7+(850/3.2808),\"NA\")","v":"NA"},null,null,null,null,null,{"$f":"IF(FORMULÁRIO!O136=\"aplicável\",FORMULÁRIO!$C$7+(850/3.2808),\"NA\")","v":"NA"}]